program: Gaussian 09
title: 000187682
version: EM64L-G09RevD.01
frameworkgroup: C1[X(C12H7BrCl2O)]
method: RPBEPBE
basis: SDD
operation: Freq
keyword: #p
keyword: freq=noraman
keyword: PBEPBE/SDD
title: #p freq=noraman PBEPBE/SDD
converged: YES YES NO NO
title: Mulliken charges:
elementType: Br Cl Cl O C C C C C C C C C C C C H H H H H H H
charge: 0.064412 0.037369 0.037100 -0.284163 0.484679 0.352579 -0.308196 -0.353697 -0.020127 -0.166323 -0.360379 -0.380948 -0.235336 -0.200912 -0.191563 -0.245893 0.282488 0.256901 0.267472 0.262797 0.233214 0.234239 0.234287
chargesum: 0.00000
title: Mulliken charges with hydrogens summed into heavy atoms:
elementType: Br Cl Cl O C C C C C C C C C C C C
charge: 0.064412 0.037369 0.037100 -0.284163 0.484679 0.352579 -0.308196 -0.071209 -0.020127 0.090578 -0.092907 -0.118152 -0.235336 0.032302 0.042676 -0.011606
polarizability: 2.65117333e+02 -6.16946934e+00 1.56636160e+02 -1.14560890e+01 -7.75369283e+00 9.22132312e+01
1716.lowfreq: -8.6313 -4.9936 -2.6215 -0.0025 -0.0022 -0.0011 20.0612 33.8623 51.6294
frequency: 20.0265 33.7743 51.6259 72.8994 115.5810 152.9806 173.7933 199.9502 217.1753 232.1349 270.9105 297.5502 322.4101 409.4666 412.1640 460.4253 482.9105 489.5306 502.8583 560.0121 604.6531 610.2013 652.6764 692.1791 716.3180 729.0687 760.0534 773.3004 808.8796 838.5330 894.7502 911.4792 943.2737 971.5172 987.4723 991.1770 1019.6525 1034.7447 1077.3724 1135.0264 1160.4541 1166.0878 1172.2668 1186.9465 1245.2868 1308.0444 1343.8646 1364.6817 1383.5731 1424.1242 1441.7715 1471.5484 1550.3313 1574.0430 1596.5484 1608.0852 3134.6092 3143.6797 3157.4071 3163.0890 3167.2436 3177.5225 3181.4274
redmass: 6.3673 4.7443 7.0175 24.0748 6.6863 23.8630 7.7583 12.7360 12.2344 6.7409 10.0978 6.5511 11.4504 3.8362 4.4637 9.2916 7.0462 3.9328 4.5868 5.5774 7.1956 6.4813 7.1524 2.3396 5.7486 8.2592 2.1425 3.0812 1.4458 1.2464 7.3929 1.4253 1.3347 1.3627 6.2815 1.3048 2.1519 7.8640 1.5112 2.4687 1.5845 1.4617 1.1083 1.6468 3.6662 1.3599 5.1870 7.1590 8.7018 2.7817 2.2673 2.2521 8.1919 7.3592 6.3563 6.7104 1.0852 1.0891 1.0934 1.0884 1.0968 1.1003 1.0973
irintensity: 1.1003 0.0629 0.1603 0.0420 1.2950 0.0478 0.1148 0.2783 0.3053 4.4151 3.3828 0.2674 4.0059 0.2321 0.8706 8.3356 11.1912 13.7794 0.8530 8.6866 4.3585 1.9380 13.2412 23.3564 6.4178 25.2252 105.0719 19.1578 35.1763 1.5764 81.4053 5.3094 0.2459 0.2695 3.2731 0.4200 12.8853 44.9834 12.2989 39.0744 73.1702 2.9184 6.5393 39.3326 346.4081 2.1780 31.2000 17.7545 2.4641 324.5354 16.6680 115.4711 0.8270 93.6560 22.3224 25.3401 1.9309 8.8562 26.0917 1.0056 13.0782 6.9177 0.7470
temp: 298.150 k
press: 1.00000 atm
elementType: 35 17 17 8 6 6 6 6 6 6 6 6 6 6 6 6 1 1 1 1 1 1 1
symmnumber: 1
zpe: 399272.5 jmol-1
zpe.correction: 0.152075 hartree
zpe.thermalcorrener: 0.166484 hartree
zpe.thermalcorrenthalpy: 0.167428 hartree
zpe.thermalcorrgfe: 0.107228 hartree
zpe.sumelectzpe: -1469.138869 hartree
zpe.sumelectthermal: -1469.124459 hartree
zpe.sumelectthermalent: -1469.123515 hartree
zpe.sumelectthermalfe: -1469.183716 hartree
dipole: 3.3192 -3.0471 -0.0718
dipole: 4.5063
quadrupole: -104.0364 -114.1937 -113.0667
quadrupole: -4.5212 -1.1567 -2.4508
quadrupole: 6.3959 -3.7615 -2.6344 -4.5212 -1.1567 -2.4508
hfenergy: -1469.2909434 hartree
pointgroup: C01 [X(C12H7Br1Cl2O1)]
dipole: -1.3839821 -1.0710589 -0.2841166 debye
dipolederiv: -0.5384585 0.2457452 0.0477254 0.2962114 -0.1295321 -0.0278698 0.0772431 -0.0360209 0.0047355 -0.0370385 0.0905407 0.011475 0.1054716 -0.6358917 -0.0783392 0.0052887 -0.070856 -0.0092301 -0.462498 -0.2991342 -0.0122132 -0.3464308 -0.2475149 -0.0071332 0.0013016 -0.0050645 -0.0055743 -2.5176055 -0.0013574 -0.1759574 -0.1090096 -0.2728835 -0.0765728 0.1634877 -0.0692131 -0.2311577 1.8046371 -0.1444983 0.0489691 -0.5703572 -0.0185609 -0.0792748 -0.4378693 -0.0354048 0.0850844 1.6843913 0.1769845 0.2262891 0.7438637 0.1072179 0.1169903 0.3480644 0.0567016 0.2337587 -0.4298671 -0.1191152 -0.0372453 -0.2793228 0.8784742 0.1318261 -0.045905 0.1262559 -0.0639647 -0.2938431 -0.0754395 -0.0348797 0.2933866 -0.033221 0.0275097 0.0841482 0.0153389 -0.1524151 0.5357894 0.5786885 0.0375254 0.5636098 0.2277987 -0.0134499 0.0213414 -0.0224278 0.0075671 -0.088197 0.1935071 0.0214691 0.073631 -0.0051016 -0.0023814 0.0006615 -0.0065592 -0.0716965 -0.281094 0.0132314 -0.0523661 -0.1432792 -0.1517826 -0.0088163 -0.2795549 -0.018276 -0.1252692 -0.4140759 -0.0102986 -0.0597804 0.0020106 -0.1110224 0.0678378 0.0262315 0.0795317 0.0038017 0.7121518 -0.6217635 -0.1182647 -0.5299441 0.0487983 0.0580233 -0.1183888 0.0737257 -0.119306 0.0886918 0.0385227 -0.031002 0.0703982 -0.0858337 0.0885417 0.0234038 0.0949186 0.1164268 0.1286651 0.0370403 -0.0471592 0.0469176 -0.1079736 0.0661991 -0.079655 0.0544514 0.0581797 -0.0425649 0.0722817 0.0587213 0.0398588 -0.1417464 0.0349169 0.0464348 0.0388881 -0.1326074 0.0211445 -0.0440431 0.0185625 -0.092113 0.0497921 -0.0181386 0.0404828 -0.0203101 0.150082 0.072333 0.0088197 0.0011959 0.024296 -0.0289117 -0.0146264 -0.0022604 -0.0208603 0.1562245 0.003767 -0.0156786 0.0824139 -0.0340714 0.1290875 -0.0250097 0.1345951 -0.0142824 0.0715274 0.130357 -0.0311783 -0.0231594 -0.0287233 0.1329103 -0.0726092 -0.0221722 -0.0672361 -0.0089829 0.0665465 -0.0150127 -0.0077695 -0.0276774 0.1206852 -0.0875299 -0.0408006 -0.0821209 -0.0725075 -0.0595132 -0.0053044 0.0962537 -0.0133127 0.1436336 -0.0305404 0.1079566 -0.0266917 0.0256933 -0.0837185 -0.0725381 -0.0508034 -0.0854137 0.1315784 -0.0495535 -0.054035 -0.044488 0.0796306 unknown
polarizability: 266.063878|-0.7031601|149.0885401|-3.8462158|22.0453203|98.8143059 unknown
InChI: InChI=1S/C12H7BrCl2O/c13-9-6-7-10(12(15)11(9)14)16-8-4-2-1-3-5-8/h1-7H
charge 0 multiplicity 1
23 atoms
Br 4.793707 -1.723471 -0.11903
Cl 1.372432 2.835377 0.606637
Cl 4.336403 1.585516 0.261963
O  -0.775209 0.838847 0.640449
C  0.459764 0.222323 0.403159
C  -1.985661 0.260287 0.156295
C  1.604561 1.060522 0.407534
C  0.617893 -1.174841 0.25387
C  2.897199 0.503324 0.256655
C  1.902781 -1.726859 0.099725
C  -2.101473 -0.251328 -1.155832
C  -3.095557 0.331207 1.022451
C  3.043506 -0.896334 0.098751
C  -3.360931 -0.717076 -1.594389
C  -4.349502 -0.133771 0.566626
C  -4.485927 -0.66341 -0.737945
H  -0.259627 -1.82655 0.268937
H  2.022244 -2.80763 -0.011582
H  -1.234363 -0.271029 -1.823707
H  -2.965763 0.749236 2.024868
H  -3.462784 -1.111268 -2.611299
H  -5.21751 -0.082045 1.232524
H  -5.459383 -1.023424 -1.086662
