program: Gaussian 09
title: 000187681
version: EM64L-G09RevD.01
frameworkgroup: C1[X(C12H6BrCl3O)]
method: RPBEPBE
basis: SDD
operation: Freq
keyword: #p
keyword: freq=noraman
keyword: PBEPBE/SDD
title: #p freq=noraman PBEPBE/SDD
converged: YES YES NO NO
title: Mulliken charges:
elementType: Br Cl Cl Cl O C C C C C C C C C C C C H H H H H H
charge: 0.072426 0.048095 0.045246 0.048667 -0.282005 0.513397 0.346717 -0.354583 -0.320730 -0.008678 -0.173116 -0.110980 -0.356445 -0.376454 -0.199515 -0.191086 -0.242324 0.302981 0.267736 0.263574 0.235542 0.235734 0.235800
chargesum: 0.00000
title: Mulliken charges with hydrogens summed into heavy atoms:
elementType: Br Cl Cl Cl O C C C C C C C C C C C C
charge: 0.072426 0.048095 0.045246 0.048667 -0.282005 0.513397 0.346717 -0.354583 -0.017748 -0.008678 -0.173116 -0.110980 -0.088710 -0.112880 0.036027 0.044648 -0.006523
polarizability: 2.51525323e+02 1.13694118e+01 1.97430689e+02 1.14431790e+01 -9.76223963e+00 9.72556028e+01
1716.lowfreq: -4.2864 -0.0022 -0.0019 -0.0014 1.7154 5.2945 20.6766 33.0147 52.1238
frequency: 20.6130 32.9909 52.1213 64.1102 78.2677 145.5912 152.1047 166.2390 191.0114 209.3394 233.5026 256.7687 258.4286 317.5701 332.4078 339.4877 410.0929 439.3128 493.9523 507.2245 523.2002 532.6998 599.4031 608.8800 632.7959 678.0011 692.7936 717.8542 756.8805 768.2275 795.6013 835.4434 867.6444 912.5688 918.9388 970.9327 987.9726 992.4555 1019.4308 1043.5409 1077.0007 1155.6629 1165.7060 1172.7608 1184.4271 1239.7938 1306.2250 1320.5417 1355.1255 1382.4374 1405.1332 1441.2963 1470.8143 1538.0755 1564.1933 1596.8673 1606.7605 3136.2145 3144.9590 3157.5926 3167.8330 3178.1776 3181.0448
redmass: 8.0050 4.7560 7.1696 11.9475 25.6855 15.3161 9.9767 8.9906 17.4275 29.9293 8.4027 21.4325 6.5818 7.5126 22.8831 11.7776 2.8999 6.0320 9.9035 4.0516 5.0210 10.4743 10.1926 6.5213 7.6303 7.6687 2.2616 5.1437 4.4186 2.1454 7.2316 1.2683 1.4393 1.7715 4.1130 1.3692 6.3047 1.3112 2.1406 8.5960 1.5111 2.3953 1.5457 1.0911 1.5260 5.4595 1.4797 5.7780 10.2482 8.7394 3.8514 2.2486 2.2516 9.9436 8.3307 6.3167 6.7247 1.0853 1.0890 1.0937 1.0970 1.1003 1.0922
irintensity: 0.6353 0.1173 0.0901 0.3890 0.0710 0.3188 0.9246 0.0661 0.0165 0.0101 0.4613 0.2832 1.5279 1.6046 0.7468 4.9710 0.2468 1.7642 12.2139 19.8850 3.0355 12.4220 2.1714 1.2533 6.0957 43.5498 19.7735 2.0488 47.3204 60.5336 33.5370 1.0904 17.8829 13.2641 53.0656 0.2574 3.8056 0.5606 14.6110 59.2796 12.1632 138.0470 19.9078 5.3476 43.2005 138.8826 12.8380 161.9061 24.9513 8.6954 282.6312 8.6898 121.4791 24.3350 146.6609 17.2598 17.7660 1.5885 7.3809 22.2574 13.1921 7.5070 0.8432
temp: 298.150 k
press: 1.00000 atm
elementType: 35 17 17 17 8 6 6 6 6 6 6 6 6 6 6 6 6 1 1 1 1 1 1
symmnumber: 1
zpe: 373863.2 jmol-1
zpe.correction: 0.142397 hartree
zpe.thermalcorrener: 0.158147 hartree
zpe.thermalcorrenthalpy: 0.159091 hartree
zpe.thermalcorrgfe: 0.095666 hartree
zpe.sumelectzpe: -1928.521308 hartree
zpe.sumelectthermal: -1928.505558 hartree
zpe.sumelectthermalent: -1928.504614 hartree
zpe.sumelectthermalfe: -1928.568039 hartree
dipole: -3.7420 -1.8045 0.1986
dipole: 4.1591
quadrupole: -115.6297 -131.4383 -123.5895
quadrupole: 5.7375 1.1196 -2.6464
quadrupole: 7.9228 -7.8858 -0.0370 5.7375 1.1196 -2.6464
hfenergy: -1928.663705 hartree
pointgroup: C01 [X(C12H6Br1Cl3O1)]
dipole: -1.5064898 -0.5725558 0.2831721 debye
dipolederiv: -0.0139315 0.0311295 -0.0035075 0.1561535 -0.5908215 0.1006467 -0.0217921 0.1188335 -0.002529 -0.0306147 0.1147212 -0.0237577 0.1213092 -0.6384172 0.1316496 -0.0151252 0.1299273 -0.0198431 -0.4358417 -0.3268146 0.0539755 -0.3393105 -0.287495 0.0460668 0.043487 0.0434254 -0.0031516 -0.6506723 0.199112 -0.0540434 0.2165967 -0.0769167 0.0217265 -0.0877431 0.0317349 -0.0008153 -2.3941937 -0.0059603 0.1486964 -0.195824 -0.3113664 0.0804392 -0.1419139 0.0603317 -0.232964 1.8024617 -0.0929019 -0.0585148 -0.4957851 0.0542779 0.0744346 0.3860457 0.0557118 0.0926907 1.531462 0.1834968 -0.1839501 0.7920007 0.1198413 -0.109463 -0.3214284 -0.0437317 0.2348446 -0.4644628 -0.1425434 0.0544474 -0.3361144 0.8600688 -0.203603 0.0798515 -0.2085766 -0.0502681 -0.4072601 -0.0291592 0.0271778 0.393273 -0.3682434 0.0315057 -0.1130345 0.0523052 -0.1102594 0.5962189 0.4389334 -0.0773147 0.5651024 0.3554367 -0.0428338 -0.0819059 -0.0476779 0.0114601 0.11245 0.000853 0.0005962 -0.1656963 1.0980597 -0.1956067 0.0386099 -0.2288561 -0.051521 0.6732363 -0.3452885 0.1004542 -0.4329032 -0.3638773 0.027451 0.1321859 0.0320423 -0.0435816 -0.2712568 0.026419 0.0573847 -0.1087588 -0.1402091 0.0120932 0.2366847 0.0291456 -0.1133922 -0.3745816 -0.0039523 0.0385363 -0.0237845 -0.1101156 -0.0498658 -0.0157606 -0.0736205 0.0111825 0.0540089 0.0505264 0.0205762 0.0799934 -0.0900334 -0.0681479 -0.0217755 -0.0716382 0.1293303 0.0951631 0.0602911 0.0620915 0.0738882 -0.1074208 -0.0358779 0.0925814 -0.0245767 0.0613268 -0.0281019 0.0898206 -0.0539263 0.0536871 -0.1219972 -0.0386519 -0.0471757 -0.0408237 -0.1167255 0.0926936 -0.0399719 -0.0091466 -0.0867183 0.0633791 0.0243185 -0.024408 0.0209414 0.1423656 0.0181385 -0.0381422 -0.0834998 -0.0580618 0.1249303 0.0108657 -0.128163 0.0066689 0.0635106 0.1357528 -0.0369972 0.0256205 -0.0321057 0.1359495 0.0596721 0.0266993 0.0521764 -0.0151416 0.0694159 -0.0195616 0.008809 -0.0333249 0.1295691 0.0686453 0.0412769 0.0610521 -0.0787359 -0.0425818 -0.0292792 -0.0962122 -0.0426446 0.1428385 0.0092981 -0.1071749 0.0054148 0.0148201 -0.0675029 -0.0847308 0.0455074 -0.1009722 0.1225626 0.0452369 0.0499785 0.0397901 0.0773968 unknown
polarizability: 253.3534692|8.1971253|186.6201841|1.7959548|-31.3936706|106.2379612 unknown
InChI: InChI=1S/C12H6BrCl3O/c13-8-6-9(11(15)12(16)10(8)14)17-7-4-2-1-3-5-7/h1-6H
charge 0 multiplicity 1
23 atoms
Br 2.091488 -3.281361 0.430761
Cl 1.120619 3.086923 -0.829889
Cl 4.143358 1.98156 -0.484521
Cl 4.653472 -1.128801 0.154785
O  -0.938364 1.014722 -0.582835
C  0.328663 0.469633 -0.354757
C  -2.114572 0.354376 -0.112546
C  1.433234 1.35191 -0.479202
C  0.549109 -0.899316 -0.08851
C  2.746844 0.856369 -0.328066
C  1.861755 -1.381967 0.065779
C  2.973667 -0.516657 -0.048697
C  -2.247456 -0.052085 1.233661
C  -3.177455 0.240145 -1.030513
C  -3.47735 -0.6033 1.6570
C  -4.403375 -0.307571 -0.589842
C  -4.555427 -0.734728 0.749976
H  -0.299476 -1.582679 -0.01378
H  -1.417809 0.072833 1.937048
H  -3.036212 0.583047 -2.059528
H  -3.593507 -0.919698 2.699046
H  -5.236708 -0.400001 -1.294329
H  -5.506699 -1.159759 1.086458
