program: Gaussian 09
title: 000015846
version: EM64L-G09RevD.01
frameworkgroup: C1[X(C10H8N2)]
method: RPBEPBE
basis: SDD
operation: Freq
keyword: #pfreq=noraman
keyword: PBEPBE/SDD
title: #p freq=noraman PBEPBE/SDD
converged: YES YES NO NO
title: Mulliken charges:
elementType: N N C C C C C C C C C C H H H H H H H H
charge: 0.008387 0.019886 -0.613586 0.488024 -0.125417 -0.405824 -0.366978 -0.222003 -0.227110 -0.232406 -0.136057 -0.164003 0.245985 0.252896 0.304876 0.232988 0.241602 0.230562 0.233800 0.234377
chargesum: 0.00000
title: Mulliken charges with hydrogens summed into heavy atoms:
elementType: N N C C C C C C C C C C
charge: 0.008387 0.019886 -0.114705 0.488024 0.179460 -0.172836 -0.125376 0.008560 0.006690 0.001971 -0.136057 -0.164003
polarizability: 1.43715737e+02 1.10474570e+01 1.09979334e+02 -1.29154202e+01 9.56837604e+00 6.77613068e+01
1716.lowfreq: -6.2771 -0.0007 0.0003 0.0005 5.2622 12.0875 30.9402 54.4067 74.4708
frequency: 30.8143 54.3884 74.4670 126.8497 165.2910 194.7364 273.6359 337.3333 370.8156 403.1435 442.3600 479.7952 564.5407 568.2973 586.4938 617.2331 705.7877 751.2605 802.6837 819.8632 855.5799 921.4085 940.9844 979.6787 989.8840 991.2462 1000.6955 1022.3652 1027.6172 1087.4567 1160.5543 1175.8419 1191.9028 1216.4914 1245.6606 1286.5790 1321.7752 1333.3176 1383.9939 1442.7381 1476.3379 1485.7209 1594.5782 1614.8469 2204.5137 2207.8228 2994.8641 3019.1823 3084.4083 3114.2589 3127.3785 3138.0268 3150.9019 3167.7639
redmass: 5.3599 4.7478 6.1175 10.6080 6.3782 7.3646 5.0276 2.4076 6.9556 2.8175 7.4848 4.1060 6.4364 4.6120 5.9287 6.2326 1.8612 1.8604 4.0187 3.2208 1.2472 1.5103 2.2143 1.3969 5.2090 5.5108 1.3406 2.9909 2.2051 1.5826 1.1521 1.0524 1.1242 2.5128 1.1929 1.3220 1.4323 1.2613 7.7965 2.1651 1.1364 2.1672 6.0053 6.0869 12.5634 12.5588 1.0809 1.0607 1.1044 1.0884 1.0869 1.0909 1.0958 1.1015
irintensity: 0.4400 2.2852 1.0547 5.8786 1.0630 6.5781 2.8629 0.4117 0.2556 0.0136 0.2975 5.4160 7.7274 19.0566 5.3366 0.1708 49.4186 47.1069 1.5533 4.1517 0.0390 2.1744 2.3924 0.0712 0.6327 0.6089 0.0981 4.9542 5.5710 13.6202 2.4910 0.0858 0.2944 2.1269 4.4273 3.9017 1.3812 0.9421 0.0530 9.4058 14.2432 10.3090 1.4309 1.8732 3.7775 1.7035 0.0778 15.5580 6.4390 9.4529 3.2914 9.5822 30.9081 17.5961
temp: 298.150 k
press: 1.00000 atm
elementType: 7 7 6 6 6 6 6 6 6 6 6 6 1 1 1 1 1 1 1 1
symmnumber: 1
zpe: 396718.6 jmol-1
zpe.correction: 0.151102 hartree
zpe.thermalcorrener: 0.161862 hartree
zpe.thermalcorrenthalpy: 0.162806 hartree
zpe.thermalcorrgfe: 0.113066 hartree
zpe.sumelectzpe: -494.491885 hartree
zpe.sumelectthermal: -494.481124 hartree
zpe.sumelectthermalent: -494.480180 hartree
zpe.sumelectthermalfe: -494.529921 hartree
dipole: 4.1555 -2.2820 -0.0131
dipole: 4.7409
quadrupole: -82.8539 -74.7533 -68.6462
quadrupole: 1.0835 -1.1638 6.0105
quadrupole: -7.4361 0.6645 6.7716 1.0835 -1.1638 6.0105
hfenergy: -494.6429867 hartree
pointgroup: C01 [X(C10H8N2)]
dipole: -1.6554008 0.8594308 -0.008101 debye
dipolederiv: -0.2002691 0.0175554 -0.0005887 0.0254967 -0.1579394 -0.0311767 0.0030736 0.0118984 -0.2024131 -0.2252024 -0.0195397 0.0260932 -0.051795 -0.1996435 0.0095249 -0.0447994 -0.0050647 -0.198638 0.2481212 -0.0812274 -0.055577 -0.0784363 0.0705425 -0.0020764 -0.133083 0.0252111 0.1789245 0.1773028 0.0008183 0.0473593 0.0593291 -0.0304929 -0.0225798 0.0906683 -0.0345201 -0.0897817 0.0917351 0.0234938 0.0162148 0.0502424 0.2809871 -0.0247606 0.0333106 -0.0272787 0.2839792 -0.1207119 0.0711284 0.0150462 0.0334084 0.0358669 -0.0553557 0.0270634 -0.0457044 -0.1318618 -0.0998183 -0.0710626 0.0594772 -0.052315 -0.0048627 -0.0695186 0.0295062 -0.053125 -0.0849511 -0.0360627 -0.0591655 0.0714652 -0.0832788 0.0289915 -0.0905933 0.0717681 -0.0921311 -0.0737461 -0.0410499 0.0904122 0.0043078 0.0989711 0.0839467 -0.0693471 0.0018171 -0.0565662 -0.1040135 0.0690475 0.0472316 0.077419 0.0500498 -0.0732509 -0.0155135 0.0677893 -0.018822 -0.1180782 -0.1099002 -0.0018923 0.001036 -0.0761495 0.0608027 0.0235527 0.0135912 -0.0084984 -0.0489143 0.05107 0.0676402 0.0246884 0.1599813 -0.0888413 -0.0051668 0.1540334 0.0002783 -0.0421092 0.0232277 0.0108135 0.0047099 -0.0560834 -0.0962257 -0.0501555 0.0120162 -0.0170803 0.0723855 0.0022945 0.0094623 -0.0272719 0.045111 0.0505585 0.0997959 -0.0271125 0.0415467 -0.0326292 0.1002747 -0.0086028 -0.0403251 -0.023542 0.0305003 0.0181766 -0.0503573 0.007767 0.0371677 0.0519645 -0.1096142 -0.0004161 -0.0964269 -0.0493768 0.0521166 -0.0041721 0.0394538 0.1220825 0.0403666 0.0667742 -0.0787267 0.0657032 0.0192936 0.0656162 -0.079124 0.0671643 0.0855618 0.026238 0.0624951 -0.0704931 0.0718856 -0.0039348 0.0934228 -0.0833081 0.0910711 0.0914681 0.0467419 -0.0745202 -0.0010187 -0.0978214 -0.0501311 0.0613581 -0.0049794 0.060918 0.1281825 -0.09537 -0.0422004 -0.0733998 -0.0443304 0.093209 0.0126802 -0.0777016 0.0134821 0.1273844 unknown
polarizability: 142.6222276|11.5052006|111.0983913|15.025915|-7.5397974|67.7357582 unknown
InChI: InChI=1S/C10H8N2/c11-7-10(8-12)6-9-4-2-1-3-5-9/h1-5,10H,6H2
charge 0 multiplicity 1
20 atoms
N  1.629734 -2.424632 -0.659027
N  4.104674 1.126477 0.28374
C  0.634059 0.653266 0.839387
C  -0.806652 0.377465 0.440079
C  1.65508 0.22254 -0.289703
C  -1.549645 1.355728 -0.270202
C  -1.423603 -0.862366 0.746224
C  -2.880998 1.100997 -0.667766
C  -2.754781 -1.119649 0.349269
C  -3.486786 -0.139304 -0.359363
C  1.656461 -1.243695 -0.501601
C  3.022224 0.703779 0.018195
H  0.793457 1.732805 1.011754
H  0.906915 0.122774 1.767974
H  1.331712 0.699411 -1.237338
H  -1.090321 2.325716 -0.501016
H  -0.862486 -1.628519 1.29456
H  -3.445547 1.867481 -1.210055
H  -3.218426 -2.081689 0.592716
H  -4.519772 -0.337982 -0.665323
