program: Gaussian 09
title: 000187652
version: EM64L-G09RevD.01
frameworkgroup: C1[X(C10H12Cl2N2O2)]
method: RPBEPBE
basis: SDD
operation: Freq
keyword: #p
keyword: freq=noraman
keyword: PBEPBE/SDD
title: #p freq=noraman PBEPBE/SDD
converged: YES YES NO NO
title: Mulliken charges:
elementType: Cl Cl O O N N C C C C C C C C C C H H H H H H H H H H H H
charge: -0.024548 -0.019170 -0.489727 -0.301482 -0.410476 -0.497027 -0.041317 -0.337650 -0.696257 0.282955 0.522513 -0.459678 -0.347299 -0.024419 -0.180544 -0.123059 0.214200 0.251643 0.224237 0.315570 0.213427 0.232137 0.226714 0.296876 0.248599 0.317921 0.350920 0.254940
chargesum: 0.00000
title: Mulliken charges with hydrogens summed into heavy atoms:
elementType: Cl Cl O O N N C C C C C C C C C C
charge: -0.024548 -0.019170 -0.138807 -0.301482 -0.094906 -0.200151 0.172883 0.138230 -0.023979 0.282955 0.522513 -0.211079 -0.029378 -0.024419 0.074396 -0.123059
polarizability: 2.54617961e+02 -9.13922215e-01 1.46742003e+02 -7.08619184e+00 -2.61165205e+00 7.48434450e+01
1716.lowfreq: -11.1935 -4.7911 -0.0020 -0.0017 -0.0017 1.8769 15.6103 25.9201 45.6661
frequency: 15.4251 25.1354 45.6566 62.8116 81.1577 110.1502 121.3909 173.7990 189.0273 206.3775 219.6479 226.2494 250.8740 289.5594 292.9161 315.9579 346.4834 396.6936 432.2127 438.1892 450.4194 458.7758 484.6891 528.4432 579.1213 629.5088 654.0528 671.4680 685.9584 704.2413 747.8765 805.8905 832.8171 854.9004 862.3197 895.0334 934.2203 975.8796 986.5431 994.4246 1067.8024 1091.1957 1110.6547 1121.6871 1124.6901 1143.5278 1189.3017 1224.3940 1242.6927 1264.4168 1290.9558 1312.8465 1334.5517 1346.1249 1386.0877 1387.6719 1394.4202 1457.4408 1467.2459 1470.0287 1472.7584 1486.3058 1501.9997 1578.2621 1607.4865 1644.9070 2965.8013 2980.7968 2988.0606 3073.3025 3083.8485 3091.3533 3140.6465 3164.0405 3197.6924 3527.8680 3538.3524 3582.8698
redmass: 5.4946 4.5177 4.7004 6.1606 6.7551 5.5113 5.6269 16.6352 5.7127 4.9763 1.3002 2.5090 3.7279 1.8796 1.9852 4.8937 5.7070 4.1462 6.9686 3.0448 2.0847 3.0884 1.7666 4.3919 4.5241 1.2542 6.4626 5.7032 3.1439 9.0643 5.6670 3.4225 1.3272 1.6515 5.4531 1.6019 1.8340 1.3051 4.1126 4.9751 1.6974 2.5137 2.2968 2.2333 3.5448 1.3368 1.1962 1.7343 1.4455 1.1832 2.3461 1.2935 1.4257 2.9276 1.4355 1.3424 5.7496 1.1064 2.4747 1.0533 1.0906 1.9401 2.6042 5.6278 6.4952 4.3850 1.0809 1.0376 1.0694 1.0988 1.0968 1.0992 1.0922 1.0908 1.0953 1.0768 1.0766 1.0665
irintensity: 1.0085 0.4460 2.2857 1.4677 11.3395 10.1838 0.9205 0.0024 2.0920 0.0678 0.0208 1.0933 1.0427 60.3720 92.8833 0.3402 28.0748 33.1479 6.1017 8.4450 12.9200 7.3432 0.4662 8.2162 23.5554 191.5677 15.9724 7.8610 11.8130 6.0749 10.6714 28.7845 10.5569 75.5372 9.0261 9.9502 16.3301 3.7157 34.9502 13.8209 22.1031 86.1940 20.6652 64.0387 10.1061 1.5959 11.8182 299.7732 3.4564 108.8787 17.3552 16.0254 1.7808 162.7279 24.5718 4.0630 5.1413 42.0965 319.2282 14.7187 15.7079 73.5167 810.4947 103.0212 83.8874 196.3368 16.9625 22.5134 91.1806 32.8749 2.4669 33.2216 5.8599 2.0199 13.0029 8.8643 71.6137 5.1661
temp: 298.150 k
press: 1.00000 atm
elementType: 17 17 8 8 7 7 6 6 6 6 6 6 6 6 6 6 1 1 1 1 1 1 1 1 1 1 1 1
symmnumber: 1
zpe: 550464.0 jmol-1
zpe.correction: 0.209661 hartree
zpe.thermalcorrener: 0.226547 hartree
zpe.thermalcorrenthalpy: 0.227491 hartree
zpe.thermalcorrgfe: 0.162191 hartree
zpe.sumelectzpe: -1567.153469 hartree
zpe.sumelectthermal: -1567.136583 hartree
zpe.sumelectthermalent: -1567.135639 hartree
zpe.sumelectthermalfe: -1567.200939 hartree
dipole: 6.9472 2.4346 1.0934
dipole: 7.4423
quadrupole: -95.7248 -105.5463 -109.0405
quadrupole: 7.7109 8.2169 0.3406
quadrupole: 7.7124 -2.1091 -5.6033 7.7109 8.2169 0.3406
hfenergy: -1567.3631297 hartree
pointgroup: C01 [X(C10H12Cl2N2O2)]
dipole: 2.7379297 -0.8694204 -0.5666398 debye
polarizability: 254.6052444|0.3570205|145.9019876|7.2500736|8.1941784|75.6961767 unknown
InChI: InChI=1S/C10H12Cl2N2O2/c1-6(15)5-13-10(16)14-7-2-3-8(11)9(12)4-7/h2-4,6,13-15H,5H2,1H3
charge 0 multiplicity 1
28 atoms
Cl -4.743517 -2.147977 -0.286565
Cl -5.714963 1.008264 -0.128306
O  4.705793 -1.622421 -0.544197
O  1.228935 1.56193 0.57586
N  2.473262 -0.4112 0.428843
N  0.144251 -0.519397 0.263234
C  4.719636 -0.13503 -0.55358
C  3.769032 0.251234 0.591164
C  6.137133 0.417179 -0.351249
C  1.281714 0.301989 0.431627
C  -1.208844 -0.111311 0.180658
C  -2.186273 -1.130543 0.015931
C  -1.626455 1.24679 0.251698
C  -3.549279 -0.798267 -0.077144
C  -2.996499 1.55731 0.155162
C  -3.966216 0.546589 -0.009502
H  4.293785 0.224535 -1.514539
H  3.590065 1.339394 0.604262
H  4.234921 -0.042005 1.553237
H  2.522019 -1.407508 0.202683
H  6.802098 0.132213 -1.187953
H  6.572828 0.027415 0.585994
H  6.12293 1.521387 -0.298637
H  0.302574 -1.527905 0.214295
H  -1.893139 -2.184726 -0.040759
H  -0.8797 2.030662 0.384586
H  5.314195 -1.965318 -1.244879
H  -3.321887 2.600415 0.209573
