program: Gaussian 09
title: 000187667
version: EM64L-G09RevD.01
frameworkgroup: C1[X(C10H15N3O6)]
method: RPBEPBE
basis: SDD
operation: Freq
keyword: #p
keyword: freq=noraman
keyword: PBEPBE/SDD
title: #p freq=noraman PBEPBE/SDD
converged: YES YES NO NO
title: Mulliken charges:
elementType: O O O O O O N N N C C C C C C C C C C H H H H H H H H H H H H H H H
charge: -0.259255 -0.313086 -0.407891 -0.218391 -0.413321 -0.233753 -0.093720 -0.399662 0.054766 -0.272500 -0.472956 -0.474274 -0.345402 0.243306 -0.155336 -0.390956 -0.484246 0.128681 0.184149 0.311767 0.271748 0.233161 0.268623 0.235156 0.258487 0.245457 0.304358 0.379017 0.246514 0.273012 0.269716 0.259730 0.388556 0.378543
chargesum: 0.00000
title: Mulliken charges with hydrogens summed into heavy atoms:
elementType: O O O O O O N N N C C C C C C C C C C
charge: -0.259255 -0.313086 -0.019334 -0.218391 -0.034778 -0.233753 -0.093720 -0.020645 0.054766 0.039267 0.031953 0.029506 0.158543 0.243306 0.149022 0.128570 0.045199 0.128681 0.184149
polarizability: 1.58913692e+02 -9.49855789e+00 1.34556010e+02 1.43282323e+01 -2.51729339e-02 1.40913462e+02
1716.lowfreq: -9.3379 -3.8362 -0.0008 -0.0006 -0.0004 4.4582 14.1776 19.2487 25.7699
frequency: 13.7414 19.1686 25.7541 44.9467 52.5756 69.5309 74.2153 86.1921 101.0194 131.2030 142.4922 180.5091 212.7051 223.2602 239.7785 265.7625 284.7661 326.8583 338.7310 415.3106 420.5943 442.6410 486.6373 508.5532 526.7885 558.0627 580.3946 592.0056 629.7620 641.8607 653.5663 689.4595 720.7024 737.4503 767.8049 780.0515 807.6747 841.0362 862.9151 869.6669 895.6709 912.8812 921.3492 957.1630 993.9560 1021.3037 1039.6292 1068.5744 1073.4968 1085.3794 1090.4097 1130.4251 1134.1810 1144.0090 1169.0704 1188.3486 1209.3893 1212.1330 1223.6231 1234.4422 1247.4337 1266.6329 1271.1975 1281.1652 1288.7943 1298.4242 1311.1150 1324.2796 1339.0788 1342.3386 1348.7688 1380.7227 1442.7911 1447.3408 1469.2626 1476.5392 1483.7058 1510.7590 1620.9641 1664.1738 1665.0322 2983.5530 3010.6832 3012.6916 3020.3048 3027.6227 3030.4633 3033.3993 3055.7115 3083.0577 3093.4454 3100.2629 3111.9500 3331.6666 3510.2500 3518.7159
redmass: 6.6548 9.2020 8.3568 10.5053 6.1720 6.1270 7.4419 2.7668 3.6365 4.8818 3.5228 4.7707 3.9080 4.3177 5.3537 4.9542 4.1037 3.7226 5.7242 6.7613 4.5708 4.6197 5.2464 2.7283 2.3608 2.8967 2.8295 3.3697 1.6394 3.5708 1.4223 4.4936 4.4507 5.9188 1.3168 1.3551 2.7711 3.5669 2.1761 2.5761 3.0232 2.3810 3.0351 2.4683 2.0943 2.5798 2.8966 1.9321 1.9109 2.5644 1.9916 2.5144 4.7373 1.7099 1.4803 1.2988 2.3069 2.5509 1.3954 1.2499 1.4610 2.8644 1.6012 1.7705 1.1736 1.5289 1.3287 1.3666 1.5010 1.7248 2.0474 1.7417 1.0905 1.0925 1.0886 1.0831 1.0895 1.8604 7.0063 8.7268 8.3011 1.0649 1.0659 1.0741 1.0733 1.0690 1.0695 1.0626 1.0951 1.1024 1.1034 1.1023 1.1049 1.0816 1.0639 1.0642
irintensity: 0.5870 0.8387 1.1120 1.5970 2.4496 4.0980 2.8441 0.5125 7.0427 1.1317 5.5295 5.2995 7.4910 0.2344 4.1500 4.2989 11.1723 9.8154 0.7950 6.8236 25.7288 26.7221 11.7815 50.6927 7.5341 54.5394 13.0406 51.4745 81.4697 5.7673 121.2467 4.9971 6.9802 1.5228 40.0092 142.5916 28.3720 11.3887 1.6488 7.9873 4.8421 9.6295 11.0861 0.5684 24.9528 92.7062 240.8829 71.5807 134.6011 22.1706 5.8965 4.9333 21.5283 17.1310 4.1903 1.9692 102.6603 23.6630 3.8888 1.4423 0.4314 80.5231 25.9131 3.6480 6.5810 6.4914 7.2640 7.7317 40.5413 27.0618 68.6317 52.7594 17.9279 25.1540 18.5307 15.5699 8.8258 280.8528 197.9125 306.1321 63.5977 8.4060 27.2667 3.2029 9.3407 29.5424 14.4535 20.2211 3.3187 9.7681 14.3047 15.7666 19.0776 105.7043 23.7743 37.1950
temp: 298.150 k
press: 1.00000 atm
elementType: 8 8 8 8 8 8 7 7 7 6 6 6 6 6 6 6 6 6 6 1 1 1 1 1 1 1 1 1 1 1 1 1 1 1
symmnumber: 1
zpe: 684717.8 jmol-1
zpe.correction: 0.260795 hartree
zpe.thermalcorrener: 0.280189 hartree
zpe.thermalcorrenthalpy: 0.281133 hartree
zpe.thermalcorrgfe: 0.208693 hartree
zpe.sumelectzpe: -1004.175543 hartree
zpe.sumelectthermal: -1004.156150 hartree
zpe.sumelectthermalent: -1004.155205 hartree
zpe.sumelectthermalfe: -1004.227646 hartree
dipole: -1.4044 0.0427 -0.6862
dipole: 1.5636
quadrupole: -81.1200 -103.8016 -134.4035
quadrupole: -5.8075 1.7220 2.2395
quadrupole: 25.3217 2.6401 -27.9618 -5.8075 1.7220 2.2395
hfenergy: -1004.4363384 hartree
pointgroup: C01 [X(C10H15N3O6)]
dipole: -0.5661274 -0.0414931 -0.237117 debye
polarizability: 160.7784846|-6.2261084|134.6155688|14.7333499|1.7045022|138.9891093 unknown
InChI: InChI=1S/C10H15N3O6/c14-8(15)4-3-6(10(17)18)11-9(16)7-2-1-5-13(7)12-19/h6-7,11,14,17H,1-5H2
charge 0 multiplicity 1
34 atoms
O  -1.373037 -1.554825 -1.495595
O  -0.939563 0.299359 2.616205
O  3.27944 -2.720366 0.099338
O  1.9728 -2.304208 1.975969
O  3.429199 2.853213 0.116464
O  2.228053 2.408385 -1.81865
N  -2.44006 0.594731 0.983235
N  -0.066017 -1.256186 0.412738
N  -1.735779 1.136741 2.006211
C  -2.485917 -0.858933 0.610998
C  -3.816738 -0.959773 -0.162737
C  -3.982296 0.441199 -0.816036
C  -3.436207 1.425951 0.245654
C  -1.260157 -1.256106 -0.267043
C  1.189914 -1.586864 -0.266358
C  1.83965 -0.351154 -0.962495
C  2.24808 0.756397 0.028845
C  2.140193 -2.227722 0.74073
C  2.605282 2.047028 -0.682025
H  -2.455178 -1.44692 1.547905
H  -3.765567 -1.757201 -0.919867
H  -4.643925 -1.171127 0.538088
H  -3.373308 0.488659 -1.734595
H  -5.028726 0.665178 -1.079012
H  -2.945328 2.313871 -0.184707
H  -4.220204 1.760394 0.949417
H  0.968388 -2.324795 -1.060411
H  -0.070032 -0.99159 1.413577
H  2.719635 -0.695244 -1.534023
H  1.109647 0.044403 -1.689768
H  1.412021 0.989459 0.720386
H  3.099005 0.458816 0.666993
H  3.891728 -3.124564 0.772247
H  3.611506 3.708697 -0.360275
