program: Gaussian 09
title: 000185159
version: EM64L-G09RevD.01
frameworkgroup: C1[X(C21H23ClN2)]
method: RPBEPBE
basis: SDD
operation: Freq
keyword: #p
keyword: freq=noraman
keyword: PBEPBE/SDD
title: #p freq=noraman PBEPBE/SDD
converged: NO YES NO NO
title: Mulliken charges:
elementType: Cl N N C C C C C C C C C C C C C C C C C C C C C H H H H H H H H H H H H H H H H H H H H H H H
charge: -0.063560 -0.029326 -0.405745 -0.140263 -0.246520 0.162252 -0.202624 0.326543 -0.456265 -0.536914 0.355098 0.453127 -0.235940 -0.751539 -0.788195 -0.797583 -0.043913 0.232415 -0.465379 -0.470609 -0.376493 -0.209825 -0.598858 -0.253042 0.228989 0.254621 0.268715 0.245431 0.261619 0.290206 0.222450 0.219173 0.234843 0.214758 0.235267 0.220327 0.263463 0.200592 0.256394 0.231507 0.269740 0.234191 0.306039 0.230252 0.217827 0.213797 0.222955
chargesum: 0.00000
title: Mulliken charges with hydrogens summed into heavy atoms:
elementType: Cl N N C C C C C C C C C C C C C C C C C C C C C
charge: -0.063560 -0.029326 -0.099706 0.088726 0.008100 0.162252 0.066091 0.326543 0.050786 -0.246707 0.355098 0.453127 -0.235940 -0.075073 -0.117844 -0.077135 0.187594 0.232415 -0.195639 -0.236418 -0.146241 0.008002 -0.162105 -0.253042
polarizability: 2.76698946e+02 8.45737755e+00 2.42325206e+02 2.80708348e+01 -6.02662928e+00 1.94911912e+02
1716.lowfreq: -8.9905 -0.0011 0.0014 0.0020 6.2356 10.5970 44.4980 47.6462 68.5792
frequency: 44.4770 47.6377 68.5526 81.2189 96.7505 124.6678 130.5676 143.7054 184.1855 205.2320 206.8498 215.4116 223.1106 239.4263 252.6154 256.2304 267.5739 273.4819 275.9987 293.3874 308.8584 323.6114 348.3368 358.4056 373.4995 392.4717 420.2643 452.6976 479.8587 482.6475 505.3206 515.9334 528.1519 535.4809 551.1484 571.1450 608.6339 621.9280 633.4799 652.9318 664.2621 679.0427 699.5902 727.3412 755.8521 772.7981 797.5933 808.4842 818.3997 855.9575 880.6417 885.8290 890.0754 917.4776 931.2500 934.9295 944.4114 954.7787 957.8089 984.2282 986.8281 1002.0319 1011.1542 1018.3686 1035.3003 1043.2252 1073.4988 1087.9321 1096.1961 1100.2240 1121.0043 1136.7711 1148.3851 1158.7691 1172.3105 1182.0552 1194.6300 1195.1246 1234.9253 1242.4289 1245.1702 1255.4277 1283.8937 1287.5471 1305.2972 1310.9981 1319.7287 1322.9253 1340.4969 1345.9199 1347.8368 1356.0441 1376.7585 1395.0513 1398.1891 1405.3161 1417.8775 1423.4044 1447.6198 1460.1512 1470.5889 1473.0890 1477.4496 1480.5860 1491.6668 1499.4287 1504.4712 1559.8114 1610.1412 1625.2907 1658.5779 2061.4872 2961.7280 2972.7464 2975.5276 2981.7968 3000.9166 3004.0530 3024.7667 3043.0519 3067.9418 3072.4397 3082.6125 3086.0023 3090.1982 3091.5282 3093.4385 3108.9862 3126.0665 3128.0532 3141.6574 3158.4832 3204.2473 3215.7066 3610.7868
redmass: 4.6891 6.7186 3.6211 6.1850 4.2823 5.7828 4.8701 4.3320 3.8575 2.7692 3.8179 3.6230 1.4943 1.9504 2.1220 1.3885 2.1170 2.0220 2.9633 3.7658 3.1633 3.3795 3.4093 3.4345 3.4168 4.0788 3.5243 3.1970 3.5997 3.7837 3.6380 1.5099 2.9773 2.5514 3.0910 3.3677 3.0983 5.7905 4.6475 3.6335 3.8340 2.5377 3.2523 3.8584 1.6191 1.9820 2.3097 3.1310 4.8252 2.9388 2.2493 2.0714 1.8808 2.1876 1.5459 1.9888 1.5211 3.2427 1.3254 2.2703 2.3838 1.5222 1.2387 1.7636 2.0644 2.0767 2.2565 2.6445 2.6578 1.8744 2.3069 1.9319 1.7559 1.6464 2.2109 1.6033 1.5886 2.2001 1.5912 1.6232 1.5992 1.6753 1.9334 1.5766 1.3237 1.4081 1.2982 1.4884 2.0240 1.5191 1.4969 1.3745 1.2105 1.2045 1.2230 3.1183 2.8105 1.1691 5.1263 1.0702 1.0689 1.0602 1.0586 1.0827 1.0873 1.4940 1.6051 6.3231 7.8138 7.5010 4.6641 12.6031 1.0815 1.0541 1.0635 1.0374 1.0458 1.0774 1.0623 1.0846 1.0989 1.0984 1.1000 1.0997 1.0968 1.0984 1.0744 1.0790 1.0856 1.0970 1.0915 1.0983 1.1137 1.0979 1.0809
irintensity: 0.4650 0.5126 0.6092 2.4144 1.9126 1.7052 2.7554 3.6609 1.7817 0.7771 1.3576 4.1305 0.0972 1.9892 0.2676 0.5921 2.2173 0.0579 1.0275 0.4983 4.0146 4.8970 1.8144 5.2125 0.0792 0.6265 0.6815 2.7782 0.5082 1.5795 1.7743 76.8650 1.5299 25.1364 3.5843 0.9157 0.3718 4.4637 2.7762 27.9335 11.9848 13.3661 2.2592 14.1824 47.6159 56.9713 0.6087 5.5867 2.8640 2.6163 9.3369 2.4685 3.5228 2.3269 0.2483 6.4678 41.4288 25.0986 2.3595 8.0805 16.5268 3.2992 7.9341 13.9160 3.6014 16.5493 13.2305 10.4066 1.5608 20.8108 0.1458 4.0069 15.7958 0.5174 1.2959 13.7515 6.2721 12.4090 2.3825 2.6075 0.5491 0.7290 5.4735 10.7261 4.1017 13.9244 12.4632 5.2260 6.2771 19.4731 2.5150 2.2146 24.9733 12.6126 14.5747 10.8223 7.9911 20.3242 29.9750 2.6094 11.3476 2.8576 5.9560 10.7196 17.2491 0.1328 8.0447 6.5269 7.5888 5.0768 13.1155 120.3511 5.0947 5.7023 49.4573 35.4374 7.8462 18.9180 5.3238 7.3222 3.1562 55.5732 16.6460 49.7628 22.8058 2.2948 13.7629 8.7922 1.9952 18.5019 18.6248 33.5288 19.4283 1.5557 66.0352
temp: 298.150 k
press: 1.00000 atm
elementType: 17 7 7 6 6 6 6 6 6 6 6 6 6 6 6 6 6 6 6 6 6 6 6 6 1 1 1 1 1 1 1 1 1 1 1 1 1 1 1 1 1 1 1 1 1 1 1
symmnumber: 1
zpe: 1014426.0 jmol-1
zpe.correction: 0.386374 hartree
zpe.thermalcorrener: 0.408366 hartree
zpe.thermalcorrenthalpy: 0.409310 hartree
zpe.thermalcorrgfe: 0.337617 hartree
zpe.sumelectzpe: -1381.809704 hartree
zpe.sumelectthermal: -1381.787712 hartree
zpe.sumelectthermalent: -1381.786768 hartree
zpe.sumelectthermalfe: -1381.858461 hartree
dipole: -3.8652 3.9396 -0.2542
dipole: 5.5249
quadrupole: -155.9205 -130.4666 -168.2406
quadrupole: 4.0660 -1.0455 4.6336
quadrupole: -4.3780 21.0760 -16.6980 4.0660 -1.0455 4.6336
hfenergy: -1382.196078 hartree
pointgroup: C01 [X(C21H23Cl1N2)]
dipole: 1.5386869 1.5266513 -0.1631444 debye
polarizability: 281.2874725|-6.7737622|243.1734183|20.025612|2.7831065|189.4751728 unknown
InChI: InChI=1S/C21H23ClN2/c1-6-21(4)16(22)10-14-18(19(21)23-5)12-11-24-15-9-7-8-13(17(12)15)20(14,2)3/h6-9,11,14,16,18-19,24H,1,10H2,2-4H3
charge 0 multiplicity 1
47 atoms
Cl -2.716423 -0.747264 3.020446
N  -2.670696 -0.60753 -1.775588
N  1.970063 2.786895 -0.554663
C  -0.106384 -1.409201 -0.237532
C  -0.374626 -0.131623 -1.117292
C  1.403041 -1.897372 -0.273493
C  -1.870346 0.332196 -1.009907
C  -2.460809 0.492197 0.467155
C  -0.622504 -1.192008 1.211604
C  -2.109885 -0.829492 1.207137
C  0.650553 0.939873 -0.815668
C  2.335949 -0.745072 0.135145
C  1.902203 0.553609 -0.218621
C  1.759946 -2.304547 -1.73981
C  1.589701 -3.14681 0.625997
C  -1.836917 1.729246 1.151904
C  -3.982773 0.624555 0.356463
C  2.714382 1.713194 -0.045044
C  0.724655 2.316648 -1.024424
C  3.61046 -0.84394 0.725414
C  3.99937 1.612453 0.537808
C  4.418229 0.320469 0.925865
C  -4.721479 1.733371 0.59734
C  -3.302403 -1.404758 -2.419434
H  -0.700411 -2.234908 -0.684422
H  -0.253735 -0.434007 -2.178119
H  -1.979831 1.318746 -1.500833
H  -0.501549 -2.122394 1.790462
H  -0.032595 -0.41239 1.725394
H  -2.710669 -1.659551 0.794594
H  2.792894 -2.693721 -1.785213
H  1.074726 -3.09547 -2.100661
H  1.700519 -1.44761 -2.432953
H  2.580036 -3.604705 0.450302
H  1.521904 -2.904985 1.700666
H  0.826745 -3.912787 0.391605
H  -0.75401 1.622223 1.3058
H  -1.996336 2.636381 0.541448
H  -2.316244 1.881786 2.13312
H  -4.501844 -0.290977 0.037064
H  0.003041 3.012478 -1.448888
H  4.007527 -1.817192 1.033482
H  2.266143 3.760255 -0.5692
H  4.648707 2.48175 0.687009
H  5.405159 0.202558 1.387866
H  -5.810552 1.714828 0.479702
H  -4.283839 2.679209 0.934773
