program: Gaussian 09
title: 000185149
version: EM64L-G09RevD.01
frameworkgroup: C1[X(C10H15NO)]
method: RPBEPBE
basis: SDD
operation: Freq
keyword: #p
keyword: freq=noraman
keyword: PBEPBE/SDD
title: #p freq=noraman PBEPBE/SDD
converged: YES YES NO NO
title: Mulliken charges:
elementType: O N C C C C C C C C C C H H H H H H H H H H H H H H H
charge: -0.229864 -0.269889 -0.162935 -0.427298 -0.476670 -0.476557 -0.398470 0.456090 -0.465309 -0.294660 0.053794 -0.804084 0.230589 0.251154 0.212274 0.226500 0.227541 0.237668 0.256933 0.227169 0.193382 0.215089 0.219470 0.263088 0.245161 0.258303 0.231534
chargesum: 0.00000
title: Mulliken charges with hydrogens summed into heavy atoms:
elementType: O N C C C C C C C C C C
charge: -0.229864 -0.012956 0.067654 -0.176144 -0.037897 -0.011349 0.022081 0.456090 -0.030751 -0.031572 0.053794 -0.069085
polarizability: 1.34187847e+02 6.72923666e+00 1.15014668e+02 2.52103223e-01 2.54731915e+00 8.54460171e+01
1716.lowfreq: -17.6177 -2.1899 0.0004 0.0005 0.0007 10.6946 31.8299 71.4644 144.6646
frequency: 31.4903 71.3659 144.6263 205.2466 209.5381 227.3206 271.4651 299.3427 323.5082 369.7895 396.7432 443.9395 492.9191 537.1139 592.8408 636.4247 670.1858 693.6998 724.5194 759.5939 803.7324 823.7807 872.8178 881.8586 888.4950 913.6317 928.0925 948.9867 992.1098 1005.4974 1022.2666 1030.7642 1053.2383 1066.9920 1085.7156 1135.9821 1151.8534 1188.6896 1198.8454 1222.9835 1235.6502 1239.1311 1264.8443 1285.9304 1289.2191 1301.7791 1333.0183 1342.5794 1363.4420 1366.7864 1384.8081 1427.0173 1447.6303 1449.3134 1459.3030 1463.8894 1469.1531 1487.2856 1561.2581 1650.9809 2943.4924 2977.8479 2979.7584 2993.6071 3013.6798 3023.1710 3029.6789 3048.8458 3054.9968 3061.8450 3062.7657 3081.9559 3099.5506 3120.4944 3401.9238
redmass: 3.5567 4.1661 2.2829 1.4974 1.6881 2.8988 2.1788 3.3833 4.1008 2.1265 3.2249 3.9648 2.5845 2.5250 2.9325 2.4904 2.2868 4.0218 2.6630 2.9334 1.8435 2.3467 2.1479 1.7559 2.7074 2.3603 2.2148 2.5400 2.0555 1.9724 1.8557 2.2139 2.3224 1.7786 2.8309 1.9346 1.1501 1.2355 1.3612 1.6552 1.4954 1.3041 1.5620 1.3923 1.2468 1.3188 1.4394 1.3993 1.3035 1.3027 1.6454 1.3392 1.0862 1.1104 1.0921 1.0525 1.0814 1.0892 7.0547 7.4753 1.0676 1.0379 1.0636 1.0604 1.0660 1.0829 1.0892 1.1024 1.0992 1.0953 1.0904 1.1032 1.0894 1.0989 1.0752
irintensity: 3.7818 0.8712 0.3475 1.4609 0.7149 2.1827 2.0221 0.4605 1.4459 6.0955 3.7696 9.1043 14.6309 4.7557 15.6719 18.5460 68.3891 18.4818 6.7076 2.7178 6.7000 13.8924 20.8054 5.1665 10.2503 14.2673 6.3935 13.3135 13.6860 1.8938 2.4752 2.1553 6.4689 2.0720 8.0683 13.0508 6.8522 6.4377 13.7414 75.0602 40.9145 1.1914 72.8798 2.7499 7.9742 9.5910 0.5872 0.5957 17.4424 42.2545 0.8999 7.0198 6.4747 33.1650 11.2816 19.9650 5.5885 19.7529 162.5301 45.9790 22.3528 4.8035 34.1658 18.7874 55.2338 50.6177 60.3354 11.7914 27.5780 6.8430 17.8838 57.4709 4.3394 18.1682 4.8909
temp: 298.150 k
press: 1.00000 atm
elementType: 8 7 6 6 6 6 6 6 6 6 6 6 1 1 1 1 1 1 1 1 1 1 1 1 1 1 1
symmnumber: 1
zpe: 610302.7 jmol-1
zpe.correction: 0.232452 hartree
zpe.thermalcorrener: 0.243531 hartree
zpe.thermalcorrenthalpy: 0.244475 hartree
zpe.thermalcorrgfe: 0.195419 hartree
zpe.sumelectzpe: -519.078300 hartree
zpe.sumelectthermal: -519.067221 hartree
zpe.sumelectthermalent: -519.066276 hartree
zpe.sumelectthermalfe: -519.115333 hartree
dipole: 3.7808 -2.7091 0.4286
dipole: 4.6709
quadrupole: -78.8375 -67.3960 -74.6194
quadrupole: 8.0839 1.2226 0.9684
quadrupole: -5.2199 6.2216 -1.0017 8.0839 1.2226 0.9684
hfenergy: -519.3107517 hartree
pointgroup: C01 [X(C10H15N1O1)]
dipole: 1.4579929 -1.1168489 0.0627179 debye
polarizability: 134.498374|6.2527828|114.4803083|-2.3270342|2.7876964|85.6698501 unknown
InChI: InChI=1S/C10H15NO/c1-7(12)9-4-2-3-8-5-6-10(9)11-8/h4,8,10-11H,2-3,5-6H2,1H3
charge 0 multiplicity 1
27 atoms
O  -3.098188 1.286019 0.648422
N  0.800225 -0.899383 -0.999142
C  2.104809 -0.312333 -0.562924
C  -0.053354 -0.954672 0.232481
C  2.367235 -0.923245 0.85453
C  0.944703 -1.174967 1.446094
C  2.04551 1.236129 -0.566226
C  -0.884044 0.321605 0.385035
C  1.160649 1.900088 0.525193
C  -0.315712 1.562347 0.507596
C  -2.393129 0.264831 0.382072
C  -3.084066 -1.053179 0.033721
H  2.885363 -0.617863 -1.284603
H  -0.727878 -1.820959 0.141791
H  2.975381 -0.257751 1.494623
H  2.918112 -1.875895 0.748103
H  0.852912 -2.203534 1.837938
H  0.715869 -0.486001 2.277033
H  0.942118 -1.849379 -1.376726
H  1.688083 1.555352 -1.562382
H  3.077511 1.622326 -0.44153
H  1.273459 2.996671 0.434795
H  1.572002 1.643133 1.526775
H  -1.022193 2.398453 0.616752
H  -2.7304 -1.447434 -0.937205
H  -4.170077 -0.880464 -0.014463
H  -2.8815 -1.826899 0.799348
