program: Gaussian 09
title: 000185146
version: EM64L-G09RevD.01
frameworkgroup: C1[X(C17H17N3O4)]
method: RPBEPBE
basis: SDD
operation: Freq
keyword: #p
keyword: freq=noraman
keyword: PBEPBE/SDD
title: #p freq=noraman PBEPBE/SDD
converged: YES YES NO NO
title: Mulliken charges:
elementType: O O O O N N N C C C C C C C C C C C C C C C C C H H H H H H H H H H H H H H H H H
charge: -0.229144 -0.235863 -0.194666 -0.209561 -0.206597 -0.093950 0.015716 -0.321746 0.229717 -0.443191 0.139962 0.150182 0.047590 0.050456 0.298831 -0.355730 -0.378769 0.230536 -0.361885 -0.381022 -0.421622 -0.229895 -0.604044 -0.643448 0.271411 0.242155 0.233672 0.245397 0.215776 0.197990 0.288936 0.283592 0.306194 0.293305 0.245212 0.224680 0.191521 0.223874 0.189441 0.276079 0.218908
chargesum: 0.00000
title: Mulliken charges with hydrogens summed into heavy atoms:
elementType: O O O O N N N C C C C C C C C C C C C C C C C C
charge: -0.229144 -0.235863 -0.194666 -0.209561 -0.206597 -0.093950 0.015716 0.191820 0.229717 0.035877 0.139962 0.150182 0.047590 0.050456 0.298831 0.058036 -0.089834 0.230536 -0.078293 -0.074827 -0.128316 0.015317 0.036032 0.040979
polarizability: 8.28816598e+02 2.11743550e+01 2.56476882e+02 2.34581874e+00 3.57575928e+00 1.11973270e+02
1716.lowfreq: -1.8101 -0.0007 0.0006 0.0008 5.6912 11.9157 24.5473 29.5221 34.8077
frequency: 24.5190 29.5022 34.7887 45.0603 62.4694 79.6523 89.9220 98.3846 144.3157 176.3127 193.2179 197.8872 206.2475 222.7507 257.0697 272.4337 280.3903 291.9359 312.1387 334.4889 357.9205 368.5894 373.4847 405.3245 411.8437 432.3326 433.4130 463.4253 467.1529 499.9630 546.4604 550.5315 566.7968 600.2447 624.2403 657.7263 685.6869 691.5967 717.2111 737.7686 739.8696 769.5260 783.1636 788.7580 805.6788 835.1824 849.8160 890.8271 893.2761 930.3626 963.5629 969.4235 1004.6173 1012.9341 1018.0520 1041.5156 1044.4888 1057.0263 1063.7152 1084.7831 1094.5811 1107.8209 1127.0224 1130.3861 1160.9365 1183.6822 1190.3545 1194.9615 1214.8224 1229.3454 1237.3837 1250.0652 1271.7444 1282.3907 1309.2163 1328.7978 1339.7977 1340.6309 1365.4078 1368.5540 1377.6970 1407.8688 1419.8432 1423.1215 1431.3320 1443.1658 1451.0124 1452.4686 1461.3124 1464.0420 1473.1675 1476.2948 1485.0257 1496.3369 1517.8893 1556.1801 1570.4449 1579.7463 1610.7023 1622.4628 2836.2517 2854.9570 2865.3148 3003.6272 3008.9603 3019.2463 3032.8221 3050.9894 3062.0591 3078.4579 3088.2258 3121.1211 3151.7278 3167.7619 3170.4209 3188.0450 3206.6491
redmass: 5.9669 4.4680 11.0030 3.5409 6.3406 3.8324 6.2918 4.0732 5.9416 4.9434 5.6509 3.1942 2.1738 1.1420 2.0511 4.6718 4.8030 1.9312 4.0617 2.8322 5.7314 4.3030 3.9789 4.4463 4.2511 3.7594 5.2933 3.9147 4.6218 6.0173 6.1869 5.6740 7.5101 4.4169 5.8806 5.4421 6.7878 7.2057 4.0514 1.8525 7.5522 5.6421 3.3049 4.2163 2.6600 1.9070 2.9344 1.4912 2.2732 5.2309 2.2924 1.3834 1.4327 1.3718 3.7482 1.5236 2.8541 2.5961 2.1933 1.7402 1.5792 2.1826 1.8756 1.5344 1.8330 2.1351 3.0018 1.6368 1.9634 2.3697 1.8174 2.8217 1.8942 1.9347 1.5570 1.9422 1.6446 3.1332 1.5607 1.7846 2.5067 8.2791 3.0577 1.1516 4.9644 1.1640 1.3326 1.9933 1.0519 1.0772 1.0883 1.0620 1.0564 1.0565 5.3093 10.4247 6.7476 7.4029 8.6934 8.3614 1.0704 1.0563 1.0568 1.0699 1.0776 1.0727 1.0738 1.0611 1.0990 1.1010 1.1011 1.1059 1.0887 1.0902 1.0956 1.0951 1.0942
irintensity: 0.0542 0.3052 1.6182 0.7850 3.0806 2.2992 5.6729 0.5565 3.0336 1.5541 2.7358 3.6643 3.3643 1.3584 21.8269 3.1902 12.5530 46.8645 18.5602 22.9720 12.1070 3.0284 2.7175 1.5151 0.6076 1.8266 0.1768 5.3019 1.0525 5.7122 7.8164 4.6619 2.8080 2.8301 5.6016 1.5243 0.5133 1.5700 0.3452 5.0094 11.9068 9.8419 41.0035 0.0588 13.1695 33.5611 6.3476 43.7309 29.8395 11.1525 12.4320 1.3817 1.8197 2.2191 2.5866 6.1979 17.1445 11.7004 32.8751 3.3738 47.8115 5.9271 13.5266 845.9252 140.5644 550.9400 487.6350 102.2756 5.7751 46.6242 20.6184 162.0590 31.8068 5.1802 13.1341 21.8963 107.0918 36.7776 19.8616 18.9247 50.6458 6.1568 18.2686 10.2045 10.8271 90.7560 5.6916 13.1112 26.1386 18.7109 63.8047 7.9332 6.2438 13.9040 41.2276 362.6191 2.9095 40.1648 32.1231 8.6401 163.8542 124.5658 1200.9415 27.4797 26.7862 68.3925 27.8453 9.1686 19.3903 29.7731 37.8193 8.5117 6.6691 1.3375 6.0714 3.1668 3.5776
temp: 298.150 k
press: 1.00000 atm
elementType: 8 8 8 8 7 7 7 6 6 6 6 6 6 6 6 6 6 6 6 6 6 6 6 6 1 1 1 1 1 1 1 1 1 1 1 1 1 1 1 1 1
symmnumber: 1
zpe: 830486.1 jmol-1
zpe.correction: 0.316315 hartree
zpe.thermalcorrener: 0.337585 hartree
zpe.thermalcorrenthalpy: 0.338529 hartree
zpe.thermalcorrgfe: 0.264596 hartree
zpe.sumelectzpe: -1121.378912 hartree
zpe.sumelectthermal: -1121.357643 hartree
zpe.sumelectthermalent: -1121.356699 hartree
zpe.sumelectthermalfe: -1121.430632 hartree
dipole: 3.8100 1.1804 0.5627
dipole: 4.0282
quadrupole: -156.7390 -136.7289 -140.7716
quadrupole: -4.4879 4.3899 -1.6493
quadrupole: -11.9925 8.0176 3.9749 -4.4879 4.3899 -1.6493
hfenergy: -1121.6952273 hartree
pointgroup: C01 [X(C17H17N3O4)]
dipole: 1.4908996 0.4626098 0.2734974 debye
polarizability: 828.1081447|26.8232739|255.6701653|12.5813771|14.5451934|113.4884401 unknown
InChI: InChI=1S/C17H17N3O4/c1-18(2)9-4-10-19-16(21)12-6-3-5-11-14(20(23)24)8-7-13(15(11)12)17(19)22/h3,5-8H,4,9-10H2,1-2H3
charge 0 multiplicity 1
41 atoms
O  0.97346 -2.680566 -0.395108
O  1.985243 1.867077 -0.109963
O  -5.866299 -1.420233 -0.327878
O  -5.619175 0.652669 0.57418
N  1.47554 -0.401176 -0.292924
N  5.777139 0.084253 -0.045762
N  -5.130778 -0.437332 0.077463
C  2.92963 -0.703889 -0.410166
C  -1.32852 0.207423 -0.07441
C  3.620973 -0.758984 0.968984
C  -0.888168 -1.149388 -0.204463
C  -0.356394 1.260123 -0.049611
C  0.563096 -1.485556 -0.301613
C  1.100315 0.960778 -0.147825
C  -2.741385 0.523409 0.032481
C  5.147459 -0.936451 0.823991
C  -1.820432 -2.196029 -0.246532
C  -3.653723 -0.595716 -0.02069
C  -0.761487 2.596355 0.065292
C  -3.117451 1.905211 0.14439
C  -3.204031 -1.917504 -0.162474
C  -2.143959 2.911105 0.155292
C  7.175792 -0.25022 -0.375471
C  5.623534 1.469804 0.445876
H  3.398876 0.080483 -1.024059
H  3.018496 -1.674754 -0.92314
H  3.22419 -1.609036 1.555308
H  3.394697 0.164983 1.531147
H  5.359045 -1.928336 0.37817
H  5.601436 -0.938703 1.849779
H  -1.453985 -3.221941 -0.345587
H  0.006148 3.376366 0.079791
H  -4.172428 2.16291 0.235931
H  -3.94393 -2.720249 -0.206328
H  -2.45543 3.956901 0.240251
H  7.222413 -1.254487 -0.833816
H  7.854452 -0.245965 0.515121
H  7.570241 0.478472 -1.105914
H  6.070177 1.62302 1.461029
H  4.557657 1.75171 0.484431
H  6.124866 2.160361 -0.255167
