program: Gaussian 09
title: 000187692
version: EM64L-G09RevD.01
frameworkgroup: C1[X(C20H28O6)]
method: RPBEPBE
basis: SDD
operation: Freq
keyword: #pfreq=noraman
keyword: PBEPBE/SDD
title: #p freq=noraman PBEPBE/SDD
converged: YES YES NO NO
title: Mulliken charges:
elementType: O O O O O O C C C C C C C C C C C C C C C C C C C C H H H H H H H H H H H H H H H H H H H H H H H H H H H H
charge: -0.326821 -0.234559 -0.428730 -0.260748 -0.255264 -0.220086 0.225527 0.345946 0.307293 -0.247720 -0.180270 -0.475108 -0.541162 -0.134661 -0.789088 -0.506775 -0.479348 -0.452367 -0.560329 0.460274 -0.825583 0.274928 -0.521506 -0.497914 0.240817 -0.765009 0.263717 0.228144 0.230738 0.225497 0.242144 0.271319 0.198644 0.227635 0.212940 0.251975 0.238228 0.217116 0.231461 0.279641 0.227163 0.218104 0.254729 0.351425 0.223954 0.230551 0.231503 0.281320 0.256194 0.240312 0.277095 0.258551 0.241623 0.236540
chargesum: 0.00000
title: Mulliken charges with hydrogens summed into heavy atoms:
elementType: O O O O O O C C C C C C C C C C C C C C C C C C C C
charge: -0.326821 -0.234559 -0.077305 -0.260748 -0.255264 -0.220086 0.225527 0.345946 0.307293 0.015997 0.047874 -0.018873 -0.027700 0.063982 -0.096539 -0.051431 0.031754 -0.225204 -0.087496 0.460274 -0.139575 0.274928 0.016009 0.019493 0.240817 -0.028295
polarizability: 2.64702690e+02 -1.46750824e+01 2.14764989e+02 -5.67512221e+00 -3.91550688e+00 1.94917724e+02
1716.lowfreq: -10.2115 -1.5012 -0.0237 -0.0005 0.0006 9.7795 14.9230 23.8080 36.1107
frequency: 14.0242 23.6336 36.0661 46.6110 55.5975 68.3591 82.0384 91.5235 101.3007 103.3967 120.2048 144.1540 148.4411 172.9505 177.1276 182.5110 211.8373 225.6329 248.5362 254.9682 259.9751 272.9792 278.8524 287.4482 310.2540 324.1864 327.5967 342.7337 350.9091 382.3877 399.7260 410.5325 454.1555 462.6342 472.6733 487.6414 493.6133 502.4508 521.5107 534.3477 544.0669 591.9623 594.8324 606.3641 621.6622 669.0873 719.7295 728.1839 755.8006 759.7548 768.0106 788.5197 798.3861 806.6443 832.9614 856.0930 858.7685 870.4987 880.3374 906.3274 908.7965 923.8237 926.7579 930.6866 941.2607 951.2296 973.5682 982.0188 988.6209 1015.4629 1023.1663 1031.5220 1038.6925 1047.8591 1052.7925 1054.6671 1080.7425 1086.0581 1101.2779 1113.7915 1127.0274 1133.8461 1142.7987 1147.2549 1154.8412 1165.2206 1178.0937 1180.2472 1183.8466 1198.3391 1218.6493 1230.8800 1235.6221 1247.6562 1259.2969 1267.0593 1269.6825 1283.9973 1299.2842 1310.6433 1312.2464 1320.1614 1332.0325 1345.8170 1355.9423 1366.0255 1371.5601 1374.5657 1389.9023 1393.5792 1400.8902 1415.1016 1436.8025 1442.7417 1449.1576 1451.3804 1452.9416 1455.8760 1459.1937 1461.2504 1466.9550 1469.6027 1480.5565 1484.7724 1496.3498 1631.1309 1637.1217 1695.9989 2930.2953 2962.8454 2969.1869 2969.2477 2980.1855 2982.0890 3003.3592 3008.8892 3018.6016 3020.2944 3024.0857 3032.3202 3037.6084 3058.9286 3063.5650 3067.3989 3072.3449 3073.7743 3083.7815 3083.9678 3085.6468 3091.0705 3097.7508 3110.9017 3121.8246 3122.7628 3164.8271 3516.3618
redmass: 4.8932 5.0219 4.2071 3.9658 6.5482 3.7349 3.5698 1.3029 2.6249 4.0077 3.8806 2.7138 2.1916 3.1300 1.9133 2.6878 1.2015 3.2012 2.7933 2.5965 3.0498 4.6034 4.4425 4.5329 3.1908 3.3061 3.8837 3.3804 3.2194 3.6809 3.4028 2.8087 2.3804 2.3285 1.4760 1.9317 2.4208 3.2604 4.4262 3.7471 3.4971 4.2451 4.0767 3.7776 4.4762 4.3911 4.7328 3.1382 2.7276 2.3525 1.8735 2.9815 3.0121 3.0090 2.4589 2.2233 3.1208 3.3769 2.3317 3.3136 3.1999 2.3587 1.5445 1.5785 3.5407 2.1080 2.3499 2.3298 3.3872 1.6143 2.7193 2.4002 1.7259 1.3496 2.2867 2.1407 3.2230 1.8076 1.9996 1.9538 2.4924 1.4472 1.9827 1.6859 2.0485 1.4327 2.4468 2.2302 1.8805 1.4899 1.6261 1.8691 1.2565 1.5089 1.2833 1.4019 1.5501 1.3019 2.0560 1.5305 1.2707 1.3241 1.2899 1.5730 1.7752 1.5737 1.2522 1.8084 1.3191 1.2472 1.6117 1.4454 1.0865 1.0676 1.0883 1.0811 1.0791 1.0592 1.0803 1.0491 1.0739 1.0682 1.0847 1.3805 1.0556 8.8670 7.6495 6.7495 1.0821 1.0410 1.0592 1.0609 1.0655 1.0403 1.0804 1.0380 1.0749 1.0573 1.0613 1.0937 1.0965 1.0878 1.0539 1.0949 1.1019 1.0931 1.1034 1.1008 1.0990 1.0939 1.0989 1.0989 1.0914 1.1004 1.1182 1.0659
irintensity: 0.8388 2.6563 2.2977 0.3358 4.1667 0.9734 0.5517 0.5683 1.9542 0.8400 2.0167 5.6425 2.5494 3.1273 1.8128 6.0046 2.1006 12.1671 1.3844 0.6835 4.1810 8.7953 1.3150 2.8157 2.7567 2.7935 6.0057 2.2867 13.4525 10.7056 2.4326 2.8348 11.4604 38.0772 41.9402 22.4315 53.8284 3.4567 4.1135 3.1201 20.1611 1.4311 3.1354 6.9341 25.1432 10.0032 8.3550 2.7847 2.3010 10.9299 3.5238 14.5640 4.0890 5.6315 32.5496 2.3644 6.2870 5.7223 0.5383 44.8138 70.3690 8.1879 6.1340 13.0892 18.9106 40.0750 42.2956 8.1174 11.2572 12.7268 103.9189 67.0451 12.8477 4.5980 5.9001 3.2667 38.7792 0.9889 17.6169 33.2488 315.4554 15.8910 1.7076 6.5930 16.4773 45.4176 7.4083 3.8030 8.3894 9.6075 5.1079 2.5820 129.1034 6.6377 13.2866 12.7203 2.0733 1.8807 2.1686 127.7284 14.6201 0.3929 8.5358 5.5502 4.2248 32.0152 63.9070 2.9682 18.4886 15.0810 19.3654 13.4705 15.3845 24.5274 51.2303 6.7354 30.3180 15.4120 3.8525 13.8697 11.6180 17.5746 16.1499 10.5597 13.4564 185.8374 45.0648 17.0273 42.5706 15.1453 50.3253 12.4723 53.9412 12.3484 6.4684 17.2119 34.9521 12.9027 11.2171 9.4649 21.7372 27.2276 20.3260 9.9088 25.3300 8.1439 21.2331 13.0224 11.9758 27.7037 26.0540 14.2815 24.2514 12.5228 14.8618 12.4350
temp: 298.150 k
press: 1.00000 atm
elementType: 8 8 8 8 8 8 6 6 6 6 6 6 6 6 6 6 6 6 6 6 6 6 6 6 6 6 1 1 1 1 1 1 1 1 1 1 1 1 1 1 1 1 1 1 1 1 1 1 1 1 1 1 1 1
symmnumber: 1
zpe: 1171468.1 jmol-1
zpe.correction: 0.446189 hartree
zpe.thermalcorrener: 0.472746 hartree
zpe.thermalcorrenthalpy: 0.473690 hartree
zpe.thermalcorrgfe: 0.388609 hartree
zpe.sumelectzpe: -1228.195914 hartree
zpe.sumelectthermal: -1228.169357 hartree
zpe.sumelectthermalent: -1228.168412 hartree
zpe.sumelectthermalfe: -1228.253493 hartree
dipole: -2.1723 1.1868 -0.4951
dipole: 2.5244
quadrupole: -146.0680 -162.5236 -157.3922
quadrupole: 8.7980 13.7924 0.8797
quadrupole: 9.2599 -7.1957 -2.0643 8.7980 13.7924 0.8797
hfenergy: -1228.6421021 hartree
pointgroup: C01 [X(C20H28O6)]
dipole: 0.7212436 0.663153 0.1625364 debye
polarizability: 253.9752248|24.8925392|224.8029325|-9.1028247|1.2764322|195.6072457 unknown
InChI: InChI=1S/C20H28O6/c1-12-6-7-19(10-24-17(23)5-4-13(2)21)15(8-12)26-16-9-14(22)18(19,3)20(16)11-25-20/h8,14-16,22H,4-7,9-11H2,1-3H3
charge 0 multiplicity 1
54 atoms
O  -3.237698 -2.920279 -1.292452
O  -3.565973 0.611857 0.088403
O  -2.083686 -3.465806 1.546043
O  1.382714 -0.23047 0.528569
O  2.455454 1.716261 1.256859
O  5.753027 0.583414 -1.951327
C  -1.544145 -1.482245 0.057866
C  -2.813327 -1.527897 -0.813768
C  -1.0921 0.047743 0.180028
C  -3.874569 -0.835475 0.034095
C  -2.186996 -2.007403 1.420867
C  -2.910267 -1.803284 -2.266572
C  -3.683778 -1.539222 1.398301
C  -2.270752 0.900721 0.777941
C  -0.410834 -2.403844 -0.43578
C  -0.750349 0.670617 -1.205335
C  0.099529 0.201192 1.163452
C  -2.077248 2.393947 0.658438
C  -0.301182 2.146046 -1.0958
C  -1.194544 2.981954 -0.193491
C  -1.020905 4.483365 -0.271512
C  2.484176 0.619852 0.648162
C  3.677527 0.043897 -0.090435
C  5.008214 0.657975 0.374371
C  6.058254 0.734486 -0.737826
C  7.488029 1.018962 -0.299323
H  -4.893804 -0.894286 -0.376907
H  -1.649715 -1.639256 2.309589
H  -3.77411 -1.431291 -2.83161
H  -1.994648 -1.968816 -2.847853
H  -3.945709 -0.87291 2.237895
H  -4.333964 -2.428383 1.463947
H  -2.394488 0.641316 1.853453
H  -0.823615 -3.3566 -0.808412
H  0.168036 -1.938119 -1.250007
H  0.289501 -2.638328 0.380762
H  -1.662192 0.630892 -1.828529
H  0.033303 0.083731 -1.714549
H  -0.020154 -0.443441 2.050617
H  0.216108 1.247824 1.494178
H  -2.726657 3.011353 1.291298
H  -0.282398 2.596529 -2.108636
H  0.74098 2.219042 -0.722412
H  -2.468149 -3.870296 0.723508
H  -1.24448 4.853644 -1.291445
H  0.026195 4.771129 -0.051559
H  -1.679069 5.012701 0.438432
H  3.554939 0.259455 -1.17259
H  3.667839 -1.055379 -0.001513
H  5.430954 0.122162 1.245569
H  4.823057 1.69453 0.729307
H  8.093188 1.353991 -1.155928
H  7.937929 0.091143 0.105933
H  7.519953 1.773104 0.507691
