program: Gaussian 09
title: 000187627
version: EM64L-G09RevD.01
frameworkgroup: C1[X(C18H21NO4S)]
method: RPBEPBE
basis: SDD
operation: Freq
keyword: #p
keyword: freq=noraman
keyword: PBEPBE/SDD
title: #p freq=noraman PBEPBE/SDD
converged: YES YES NO NO
title: Mulliken charges:
elementType: S O O O O N C C C C C C C C C C C C C C C C C C H H H H H H H H H H H H H H H H H H H H H
charge: 0.910231 -0.307412 -0.545220 -0.524197 -0.268221 -0.331128 0.013726 -0.417179 -0.355822 -0.233083 0.550760 -0.739372 0.016316 -0.593410 -0.434908 -0.239921 -0.280856 0.336322 -0.211638 -0.371877 -0.217983 -0.212226 -0.220134 -0.536227 0.236321 0.236563 0.285218 0.228918 0.223451 0.229167 0.265690 0.234793 0.229453 0.236993 0.304864 0.322543 0.293929 0.230698 0.252220 0.243059 0.240247 0.235510 0.216089 0.220333 0.247401
chargesum: 0.00000
title: Mulliken charges with hydrogens summed into heavy atoms:
elementType: S O O O O N C C C C C C C C C C C C C C C C C C
charge: 0.910231 -0.307412 -0.545220 -0.524197 -0.268221 -0.331128 0.250047 0.104601 0.096547 -0.003916 0.550760 -0.009436 0.016316 -0.356417 -0.130044 0.082622 0.013072 0.336322 0.019060 -0.119657 0.025076 0.028022 0.015376 0.147596
polarizability: 3.10172884e+02 -1.25777807e+01 2.32029330e+02 -2.00856866e+01 -1.28281354e+01 1.82156757e+02
1716.lowfreq: -9.1883 -4.9436 -0.0015 -0.0012 -0.0009 1.4145 18.0785 26.6263 37.2465
frequency: 18.0548 26.5701 37.1852 41.3786 55.2179 57.6465 72.8606 81.8882 101.7911 125.3787 132.1606 143.1426 171.4714 182.9107 202.3152 205.9527 224.5866 247.0604 255.2626 256.4423 265.9026 270.9461 296.2220 317.6515 338.5642 360.9019 387.1421 404.5200 427.6897 434.0979 459.9718 462.1936 480.1144 507.7183 529.0521 557.9474 601.6190 612.6984 638.0795 659.2759 691.0040 694.4234 703.0689 719.5901 761.8368 778.4748 790.1219 811.1556 816.3662 856.1151 859.4389 868.5040 884.5993 912.6918 925.7219 942.0231 948.0219 976.2049 979.2677 988.4041 992.9227 996.1498 1004.7012 1006.7709 1008.0928 1026.0130 1041.5185 1047.5161 1080.8640 1081.2780 1087.7471 1095.8545 1110.8622 1117.1087 1125.3234 1143.5553 1155.0864 1171.9465 1174.1923 1184.4142 1185.8215 1233.2474 1245.9374 1266.7794 1279.9507 1306.8855 1312.4995 1321.1107 1330.6386 1382.1092 1389.3646 1391.1021 1394.0184 1425.5130 1435.8335 1447.3287 1450.7585 1457.0713 1465.8080 1468.3929 1469.9871 1477.1704 1484.2294 1489.3202 1575.7605 1600.0432 1601.7817 1603.7866 2930.7259 2952.1477 2955.0550 2994.5020 3009.9390 3040.8993 3066.8919 3091.5819 3092.0113 3107.1680 3122.0516 3125.1790 3127.1304 3134.1195 3140.1643 3144.2812 3151.1236 3161.7616 3169.6425 3172.2306 3175.3685
redmass: 4.8654 4.8124 5.5046 4.2590 4.6545 5.6787 5.0104 4.4858 3.5266 5.2147 4.4062 6.0787 3.6100 2.8136 4.2111 2.5707 4.7976 2.5435 5.4614 4.0893 1.7746 1.6571 3.1956 4.4216 5.0714 3.4341 9.8161 2.9754 3.6312 2.8463 4.3632 4.1397 3.8935 4.9862 5.0508 4.3751 6.4770 3.8465 4.6274 7.0774 2.5696 5.5403 3.3294 2.5681 1.3912 2.9555 13.6870 1.3923 3.3831 1.2370 1.8069 3.0503 2.4929 11.0066 1.3563 1.3431 1.5406 5.9974 5.4526 1.3888 2.2892 1.5875 1.3298 2.2360 4.1645 1.2760 3.2125 2.1243 1.5973 1.7611 1.6342 1.4364 1.2616 1.4338 3.1306 1.8482 1.3520 1.0665 1.7928 1.2027 1.1231 1.5900 3.2935 1.2008 1.6494 1.2790 1.2852 1.2640 1.3938 8.3385 3.2576 1.6168 1.5351 1.5552 2.2358 1.5789 1.0946 1.9547 1.0514 1.1573 1.0823 1.1760 1.5589 1.1996 5.6960 6.2186 6.8299 6.0978 1.0826 1.0578 1.0334 1.0357 1.1018 1.1037 1.0526 1.0915 1.0996 1.1005 1.0966 1.0905 1.0922 1.0871 1.0909 1.0925 1.0921 1.0962 1.0971 1.1014 1.1192
irintensity: 0.2451 0.1443 0.1173 1.6399 1.0236 3.3200 2.4930 0.2921 7.3863 3.6932 2.8961 0.6572 0.6020 0.6142 4.3632 3.5651 5.7196 1.1759 3.1407 14.3826 0.6382 3.5876 3.4563 2.6003 13.2090 3.9233 12.0219 0.5474 3.5841 10.1448 22.5619 48.0266 27.6389 112.5894 0.1994 11.2777 1.4424 7.9525 18.0804 13.6842 34.7485 11.4908 12.6939 31.4746 77.2209 37.3411 59.4931 44.5453 42.5477 0.0478 23.1252 3.7789 12.9949 84.2528 0.2304 3.4688 2.6666 2.5065 3.8958 0.0886 6.8172 11.2127 0.3313 37.6161 4.2451 2.2544 44.8004 10.7459 5.5174 17.8279 12.3759 2.7597 0.3115 25.7585 19.4723 2.5204 0.6269 1.7723 56.5768 2.5334 7.9389 2.6211 148.5742 5.3002 66.6208 7.6658 2.4770 7.7514 3.9114 5.4489 8.8597 13.5832 8.3600 32.7200 17.8387 13.7479 14.0193 18.9664 14.6251 93.0690 16.2763 2.6349 8.3651 26.9523 4.9995 21.8689 0.3881 106.8657 12.0620 40.5035 58.2209 19.7869 5.9864 50.0477 31.8722 13.9979 38.4305 5.9256 26.6753 23.0310 9.3406 10.9387 21.1461 11.5129 2.0209 3.2477 17.0355 37.4397 22.7213
temp: 298.150 k
press: 1.00000 atm
elementType: 16 8 8 8 8 7 6 6 6 6 6 6 6 6 6 6 6 6 6 6 6 6 6 6 1 1 1 1 1 1 1 1 1 1 1 1 1 1 1 1 1 1 1 1 1
symmnumber: 1
zpe: 924514.5 jmol-1
zpe.correction: 0.352129 hartree
zpe.thermalcorrener: 0.376462 hartree
zpe.thermalcorrenthalpy: 0.377406 hartree
zpe.thermalcorrgfe: 0.296316 hartree
zpe.sumelectzpe: -1450.196448 hartree
zpe.sumelectthermal: -1450.172115 hartree
zpe.sumelectthermalent: -1450.171171 hartree
zpe.sumelectthermalfe: -1450.252261 hartree
dipole: -0.6859 3.1647 -4.9828
dipole: 5.9426
quadrupole: -135.7619 -139.9866 -151.9567
quadrupole: -13.5979 -5.8885 1.5890
quadrupole: 6.8065 2.5818 -9.3883 -13.5979 -5.8885 1.5890
hfenergy: -1450.5485767 hartree
pointgroup: C01 [X(C18H21N1O4S1)]
dipole: 0.1907835 -2.206228 0.7498954 debye
polarizability: 303.3844547|14.5274323|227.9569977|26.7735072|27.9310619|193.0175187 unknown
InChI: InChI=1S/C18H21NO4S/c1-14(15-7-6-8-16(11-15)22-2)19(12-17-13-23-17)24(20,21)18-9-4-3-5-10-18/h3-11,14,17H,12-13H2,1-2H3
charge 0 multiplicity 1
45 atoms
S  1.281665 1.4968 -0.339899
O  2.307262 -2.096167 -2.081599
O  0.504307 2.661271 0.512914
O  1.593861 1.760496 -1.922232
O  -5.357206 -1.765543 -0.069091
N  0.491085 -0.279847 -0.2665
C  0.808857 -2.099809 -1.876159
C  0.164059 -0.74461 -1.637688
C  1.378729 -2.452429 -3.218079
C  -0.544414 -0.542495 0.793192
C  -1.98767 -0.140515 0.446909
C  -0.091038 -0.027822 2.177644
C  2.912594 1.153468 0.545458
C  -2.968705 -1.162101 0.345382
C  -2.358739 1.210031 0.240945
C  3.736998 0.133561 0.040335
C  3.239844 1.973664 1.635897
C  -4.314032 -0.830901 0.049134
C  -3.704378 1.526178 -0.062601
C  -4.684821 0.520003 -0.159286
C  4.975792 -0.071626 0.691343
C  4.485371 1.749053 2.268556
C  5.347288 0.731271 1.797089
C  -5.034287 -3.175758 0.150419
H  0.4819 -2.918874 -1.22076
H  -0.931442 -0.80428 -1.804364
H  0.578012 -0.014192 -2.361957
H  1.339176 -1.70785 -4.023195
H  1.419353 -3.501682 -3.534463
H  -0.521764 -1.654265 0.849633
H  -0.131112 1.071894 2.236779
H  0.939104 -0.363842 2.392214
H  -0.762621 -0.435748 2.952555
H  -2.672817 -2.205204 0.507982
H  -1.606918 2.003678 0.317676
H  3.426013 -0.484936 -0.809083
H  2.547989 2.754199 1.968602
H  -3.990653 2.571262 -0.224533
H  -5.728918 0.750613 -0.391801
H  5.645676 -0.859625 0.331886
H  4.777996 2.369631 3.121955
H  6.310569 0.563596 2.291251
H  -4.294368 -3.541772 -0.588832
H  -4.650013 -3.348338 1.1751
H  -5.984692 -3.713142 0.017268
