program: Gaussian 09
title: 000185141
version: EM64L-G09RevD.01
frameworkgroup: C1[X(C22H23NO6)]
method: RPBEPBE
basis: SDD
operation: Freq
keyword: #p
keyword: freq=noraman
keyword: PBEPBE/SDD
title: #p freq=noraman PBEPBE/SDD
converged: YES YES NO NO
title: Mulliken charges:
elementType: O O O O O O N C C C C C C C C C C C C C C C C C C C C C C H H H H H H H H H H H H H H H H H H H H H H H
charge: -0.214234 -0.272245 -0.302183 -0.300997 -0.268173 -0.286107 -0.167565 -0.377548 0.483164 -0.359858 0.232276 -0.651340 -0.698997 0.060672 0.203041 0.530311 0.150496 -0.476036 0.006135 -0.597904 -0.507791 0.196586 -0.378819 0.209625 0.224824 -0.526829 -0.529896 -0.496894 -0.535846 0.253243 0.267398 0.234076 0.255666 0.218316 0.291784 0.259613 0.239085 0.259746 0.295157 0.250946 0.254048 0.229868 0.224971 0.222088 0.257115 0.228051 0.225993 0.229641 0.248786 0.233658 0.230668 0.242216
chargesum: 0.00000
title: Mulliken charges with hydrogens summed into heavy atoms:
elementType: O O O O O O N C C C C C C C C C C C C C C C C C C C C C C
charge: -0.214234 -0.272245 -0.302183 -0.300997 -0.268173 -0.286107 -0.167565 -0.124305 0.483164 0.141616 0.232276 -0.177358 -0.147600 0.060672 0.203041 0.530311 0.150496 -0.236951 0.006135 -0.338159 -0.212634 0.196586 -0.127873 0.209625 0.224824 0.182057 0.177358 0.207525 0.170696
polarizability: 4.00837342e+02 1.44590152e+01 2.34441761e+02 -1.19916986e+01 6.40896682e+00 2.10334066e+02
1716.lowfreq: -2.9392 -0.0009 -0.0008 -0.0004 4.3880 8.5004 13.8552 29.7253 32.3395
frequency: 12.9565 29.6555 32.3305 43.7395 57.8860 73.8544 79.8844 96.6193 102.9012 107.5810 114.5564 129.4051 144.2045 155.1892 157.2822 164.7356 171.5903 190.3806 199.9295 208.9138 235.0575 247.3556 259.3713 263.0611 279.9489 298.8465 311.4665 326.8577 334.7088 355.1169 370.3388 381.8003 410.8541 418.9049 424.7773 451.1739 463.6512 465.4601 508.5729 522.2848 544.4725 564.1383 578.1259 591.2147 608.0270 615.5054 636.8521 651.0003 675.7203 692.5412 708.0089 727.2623 742.0560 762.0786 778.4432 803.5170 820.4405 840.0033 870.4708 882.4627 889.5729 907.5142 913.7835 927.5327 942.1152 948.1963 961.1496 976.6947 990.4543 999.5719 1024.0536 1047.1523 1085.1106 1108.0121 1112.7312 1113.4915 1114.2267 1122.5900 1140.6009 1144.8082 1151.5583 1155.0093 1160.1018 1164.3092 1168.5896 1186.9543 1192.5842 1205.4237 1210.8677 1219.6829 1226.6067 1238.3653 1246.0444 1269.1208 1272.9059 1285.1190 1294.1068 1324.6078 1353.3705 1370.7137 1380.3477 1406.4973 1407.9925 1414.5488 1427.9859 1435.8817 1444.2288 1446.3781 1447.6951 1454.9216 1456.7464 1459.9218 1463.6264 1466.2925 1474.3600 1476.0641 1479.8350 1484.7730 1485.9646 1488.3969 1501.4515 1548.0255 1556.1068 1594.7422 1597.7571 1608.6617 1616.8924 2966.1489 2967.5047 2968.4470 2972.6613 2974.9011 2980.4693 2999.8465 3014.3903 3045.5645 3059.5946 3066.3507 3070.4468 3072.4494 3102.6592 3109.7118 3121.0987 3121.4406 3128.0952 3131.2386 3133.5498 3150.3263 3156.6636 3166.4909
redmass: 5.6919 4.2932 3.9081 3.4202 4.7918 5.2747 5.1042 3.0915 2.9638 3.7697 3.5101 3.8225 1.5035 1.2774 3.3658 1.3364 2.3839 2.5772 2.5114 2.8702 4.4029 4.2091 2.1356 2.0541 4.4947 4.3331 4.0746 5.0283 4.9780 4.7289 5.9851 5.0587 5.3877 4.6433 5.7553 5.0359 4.1615 4.3921 5.0397 4.6526 4.4191 4.5846 5.5843 3.8389 5.2322 5.5933 4.9497 4.2799 5.9379 4.8916 5.4355 4.8174 3.1635 3.6319 5.0881 3.9740 2.7078 2.5834 3.1424 2.4426 2.0084 3.4842 1.5586 4.4923 2.2729 1.6349 3.6674 7.3588 4.6971 3.6143 2.3819 3.5006 2.4942 1.2503 1.2587 1.2405 1.2393 2.8563 1.3599 1.5470 1.5592 1.5343 1.7027 1.6280 1.4362 3.4231 1.6108 2.4786 1.6091 1.8249 1.2366 2.1317 2.0100 1.5730 1.9973 2.7552 2.7665 1.5792 1.5609 7.0588 5.4465 2.8149 2.7867 1.6273 1.3211 1.2059 1.8697 1.1590 1.4015 1.0604 1.0593 1.0951 1.0523 1.0496 1.1001 1.4885 1.4766 1.1056 1.1489 1.0530 2.8596 9.9905 8.9543 8.4119 8.8128 7.9694 7.2425 1.0692 1.0664 1.0323 1.0310 1.0309 1.0670 1.0300 1.0831 1.0939 1.1044 1.0958 1.1033 1.1039 1.0899 1.1027 1.1030 1.1031 1.1005 1.0893 1.1059 1.0910 1.0896 1.0956
irintensity: 1.0538 1.6910 0.7108 4.4724 6.5682 0.8381 7.7655 0.7947 5.9021 4.0821 3.7368 1.1571 1.7991 1.1446 5.4075 1.4510 0.3900 3.7440 9.4017 1.6881 6.6565 14.8820 0.6474 2.5657 5.5963 2.1583 1.8659 1.5163 2.1017 5.6034 2.4553 18.9418 2.2456 6.5670 3.2449 8.5319 0.1202 5.3375 6.0610 3.2861 4.2120 24.3047 40.2830 1.2326 10.3376 8.2919 11.9135 1.1547 1.1372 26.1670 8.3161 48.2613 0.5777 1.5923 4.9420 16.4410 24.2240 11.4722 1.7107 20.2743 19.0471 11.7706 20.9211 16.3826 19.4666 7.2820 32.8441 51.9948 62.7570 22.3306 8.1951 56.5670 4.1846 0.9608 0.0550 16.6334 4.8776 148.8400 2.4547 42.0012 5.5376 4.6848 22.2790 25.4953 79.6662 35.3877 8.9111 12.4765 108.3995 44.3967 9.5739 107.6801 68.2936 84.2721 155.3070 412.5638 27.5040 42.3156 29.9788 43.3560 3.1434 20.6933 104.7676 4.7098 12.1780 2.2455 56.5903 8.0995 1.8596 21.1860 16.9902 0.9607 32.4635 15.5311 83.2763 22.1460 11.0882 15.1945 23.6809 23.7458 136.0222 78.6488 301.9862 64.2046 224.3792 20.4889 44.3046 8.5387 28.0910 47.6499 94.9122 56.7841 52.7997 80.4871 10.9927 18.1211 35.8642 15.5130 27.5492 26.1020 0.5599 35.4944 24.4901 23.6549 25.6021 10.2273 20.8945 4.4640 10.6076 8.5796
temp: 298.150 k
press: 1.00000 atm
elementType: 8 8 8 8 8 8 7 6 6 6 6 6 6 6 6 6 6 6 6 6 6 6 6 6 6 6 6 6 6 1 1 1 1 1 1 1 1 1 1 1 1 1 1 1 1 1 1 1 1 1 1 1
symmnumber: 1
zpe: 1072853.5 jmol-1
zpe.correction: 0.408628 hartree
zpe.thermalcorrener: 0.436335 hartree
zpe.thermalcorrenthalpy: 0.437279 hartree
zpe.thermalcorrgfe: 0.349432 hartree
zpe.sumelectzpe: -1356.067499 hartree
zpe.sumelectthermal: -1356.039792 hartree
zpe.sumelectthermalent: -1356.038848 hartree
zpe.sumelectthermalfe: -1356.126695 hartree
dipole: -2.2832 1.9525 -1.7164
dipole: 3.4599
quadrupole: -138.1198 -159.5934 -173.8719
quadrupole: -8.5308 -3.1558 19.8391
quadrupole: 19.0752 -2.3983 -16.6769 -8.5308 -3.1558 19.8391
hfenergy: -1356.4761269 hartree
pointgroup: C01 [X(C22H23N1O6)]
dipole: 0.8640538 0.4419041 0.9545121 debye
polarizability: 401.5131984|-12.5196822|235.9609209|-7.474435|3.4873231|208.1390484 unknown
InChI: InChI=1S/C22H23NO6/c1-26-16-6-5-13-15(22(16)29-4)11-19(24)23-8-7-12-9-17(27-2)18(28-3)10-14(12)21(25)20(13)23/h5-6,9-10,20H,7-8,11H2,1-4H3
charge 0 multiplicity 1
52 atoms
O  0.097417 1.128692 1.265614
O  -0.360479 -1.159126 -3.257635
O  -4.365964 1.266231 -1.580052
O  -5.953245 0.742049 0.7996
O  6.158947 -0.586504 -0.037694
O  5.057801 1.968198 0.857351
N  -0.214581 -1.544472 -0.964632
C  -0.514454 -1.092943 0.416337
C  -1.951709 -0.624224 0.541612
C  0.719273 -2.670425 -1.159949
C  -2.500357 0.088307 -0.550705
C  1.80113 -2.739876 -0.054349
C  -1.629084 0.328202 -1.767536
C  0.515971 0.024613 0.80498
C  -0.688581 -0.844204 -2.07319
C  2.574659 -1.447115 0.158578
C  1.974335 -0.210107 0.561692
C  -2.715006 -0.852773 1.704386
C  -3.830454 0.561789 -0.474184
C  3.972774 -1.472796 -0.027543
C  2.811312 0.921615 0.779917
C  -4.61854 0.287882 0.681372
C  -4.049727 -0.400241 1.773537
C  4.80434 -0.346564 0.169752
C  4.202393 0.880344 0.60672
C  -4.688737 2.686366 -1.301041
C  -6.895266 0.172216 -0.192967
C  7.107423 0.504594 -0.346308
C  4.435616 3.215739 1.314787
H  -0.358564 -1.949318 1.097769
H  1.175323 -2.533896 -2.155798
H  0.160379 -3.628553 -1.17772
H  2.503683 -3.543812 -0.338428
H  1.340627 -3.070247 0.898185
H  -2.232678 0.520507 -2.666759
H  -0.999222 1.228579 -1.604115
H  -2.27541 -1.385926 2.554846
H  4.470403 -2.394544 -0.346081
H  2.308834 1.835806 1.110242
H  -4.67242 -0.577353 2.655646
H  -5.431477 2.765676 -0.487069
H  -5.099822 3.082783 -2.241929
H  -3.770867 3.23926 -1.025954
H  -6.992354 -0.919291 -0.03886
H  -6.556058 0.376838 -1.224083
H  -7.859465 0.665421 0.003412
H  6.729858 1.130375 -1.173595
H  8.025581 -0.019804 -0.652323
H  7.288487 1.13352 0.538112
H  3.906716 3.067968 2.275435
H  3.729904 3.611591 0.559788
H  5.270834 3.918152 1.451132
