program: Gaussian 09
title: 000187610
version: EM64L-G09RevD.01
frameworkgroup: C1[X(C20H17FO2)]
method: RPBEPBE
basis: SDD
operation: Freq
keyword: #p
keyword: freq=noraman
keyword: PBEPBE/SDD
title: #p freq=noraman PBEPBE/SDD
converged: YES YES NO NO
title: Mulliken charges:
elementType: F O O C C C C C C C C C C C C C C C C C C C C H H H H H H H H H H H H H H H H H
charge: -0.195885 -0.441257 -0.443324 0.022404 -0.291886 0.178534 0.094560 0.169147 0.039479 0.284540 -0.135148 -0.039827 -0.336098 -0.256188 -0.426653 0.455216 -0.868882 -0.824451 -0.511609 0.208801 -0.474126 -0.391760 -0.217391 0.272463 0.205299 0.244156 0.255441 0.259975 0.309579 0.229080 0.229369 0.251984 0.243942 0.220734 0.240794 0.342429 0.246751 0.357956 0.256080 0.235772
chargesum: 0.00000
title: Mulliken charges with hydrogens summed into heavy atoms:
elementType: F O O C C C C C C C C C C C C C C C C C C C C
charge: -0.195885 -0.098828 -0.085367 0.022404 -0.019423 0.178534 0.094560 0.169147 0.039479 0.284540 0.070151 -0.039827 -0.091942 -0.000747 -0.166678 0.455216 -0.100854 -0.107792 -0.270815 0.208801 -0.227375 -0.135679 0.018381
polarizability: 3.98751028e+02 -1.27707667e+01 2.40251083e+02 -3.22863837e+00 -1.82752201e+00 1.15990959e+02
1716.lowfreq: -5.5902 -0.0010 -0.0009 -0.0004 1.8963 7.8336 42.2657 51.8658 76.6167
frequency: 42.2390 51.8652 76.6156 95.3260 106.3673 156.2970 173.7478 195.6151 206.7191 213.6300 239.6554 256.9183 264.5319 276.1967 294.2970 307.4810 330.5699 344.6114 356.5017 373.1997 380.6539 429.9573 439.1301 453.8791 471.9419 475.4535 494.5750 502.4009 517.8837 530.8784 539.4560 543.3009 586.0707 596.5473 610.3797 640.5785 668.9042 688.3652 707.9165 725.4808 762.4137 783.4105 802.1594 804.9554 818.7628 836.8584 887.8861 891.6864 905.6158 959.1448 964.1376 969.9035 978.8735 983.5619 1009.1279 1035.1991 1038.0344 1041.2952 1051.7278 1060.4783 1064.8873 1076.4024 1104.7955 1144.6290 1169.4887 1170.1316 1181.2525 1202.1361 1212.8593 1225.5769 1242.0997 1245.7151 1278.9546 1302.9376 1321.6107 1341.9352 1350.6429 1362.2178 1373.2959 1383.7122 1399.6260 1401.8288 1409.9529 1417.1843 1423.1069 1430.6883 1464.5096 1474.9077 1492.0084 1495.4882 1499.1729 1507.0418 1554.4383 1573.7342 1607.3578 1622.6123 1644.6368 2864.6191 2976.6249 2991.4530 3010.8368 3044.4685 3069.2344 3109.4729 3131.7855 3135.1570 3135.9226 3148.4225 3157.6859 3172.0829 3174.0554 3178.8077 3526.1362 3542.4219
redmass: 5.9150 5.3110 5.9513 3.9646 5.1655 2.1154 3.2660 1.6335 5.1172 4.1321 5.1750 2.8732 1.4689 4.0851 3.9630 5.6984 1.9889 2.1522 2.1443 2.8617 4.3325 5.4735 3.9370 4.7457 4.4554 4.5601 1.1521 4.3207 5.8601 3.9579 5.1444 4.9188 4.0015 3.7720 3.8998 3.5399 4.0508 4.4454 4.2482 3.0343 1.5539 2.6118 3.8688 3.3035 4.1995 1.6539 2.3143 2.2561 4.7832 2.1648 1.3299 1.5828 1.4029 2.9934 3.8679 2.1195 1.5282 1.8525 2.2800 2.1677 2.7267 2.6139 2.3075 2.2125 1.2042 1.2016 1.2621 1.4918 2.2271 1.2991 1.2810 2.0604 3.4869 3.0322 1.3711 1.9318 1.2947 3.2471 2.7099 6.4690 1.3083 1.2911 2.2797 2.7995 2.8011 3.3851 1.1730 1.1242 1.8401 1.4026 1.5228 2.3680 7.2521 6.2738 6.3605 7.4561 7.6973 1.0798 1.0420 1.0395 1.0835 1.0971 1.0971 1.0974 1.0890 1.0883 1.0931 1.0854 1.0929 1.0946 1.0993 1.0979 1.0650 1.0657
irintensity: 0.4884 0.4263 1.6625 1.8709 0.6498 2.6133 2.6635 0.7889 3.3736 2.4504 2.0812 5.7888 0.6642 0.7061 1.4988 4.9631 4.5384 43.7119 8.8254 20.4375 1.2734 0.9141 0.7592 2.7149 8.0877 0.2126 227.9813 1.2403 1.0464 6.3596 1.4544 3.4133 4.7128 5.9807 11.8363 4.6943 7.3188 1.2897 9.2519 9.4339 40.0160 4.7368 20.3115 11.7142 13.5018 71.7425 7.4299 13.3972 44.0842 24.4917 1.2820 25.6237 1.3133 17.2918 36.4418 50.2613 2.4994 37.9677 5.2820 33.2008 26.1627 2.2328 1.1995 8.8645 8.1027 10.1796 15.9002 4.4527 18.8247 79.4611 32.3258 12.7533 5.5326 19.4804 2.5176 1.9619 60.4571 7.3919 16.1353 1.9334 21.4852 10.6878 8.3490 4.5811 2.3087 24.9568 2.1724 26.3423 4.8179 22.4291 2.5324 7.9158 9.5286 12.3255 2.3514 13.5226 1.4729 48.9680 26.7602 21.5048 12.0426 17.8989 12.5428 12.0701 1.2612 5.3739 4.7249 2.4245 22.2746 19.3913 16.1108 9.0440 12.3748 5.3691
temp: 298.150 k
press: 1.00000 atm
elementType: 9 8 8 6 6 6 6 6 6 6 6 6 6 6 6 6 6 6 6 6 6 6 6 1 1 1 1 1 1 1 1 1 1 1 1 1 1 1 1 1
symmnumber: 1
zpe: 822397.5 jmol-1
zpe.correction: 0.313235 hartree
zpe.thermalcorrener: 0.332459 hartree
zpe.thermalcorrenthalpy: 0.333403 hartree
zpe.thermalcorrgfe: 0.267348 hartree
zpe.sumelectzpe: -1020.998359 hartree
zpe.sumelectthermal: -1020.979135 hartree
zpe.sumelectthermalent: -1020.978191 hartree
zpe.sumelectthermalfe: -1021.044246 hartree
dipole: -3.1637 1.6206 0.3441
dipole: 3.5712
quadrupole: -134.1528 -125.1316 -133.7211
quadrupole: 0.4798 4.1262 2.2151
quadrupole: -3.1510 5.8702 -2.7193 0.4798 4.1262 2.2151
hfenergy: -1021.3115941 hartree
pointgroup: C01 [X(C20H17F1O2)]
dipole: 1.2562321 -0.6169565 0.1238474 debye
polarizability: 399.1052776|-9.6952684|239.3978042|6.1440334|7.100606|116.4899882 unknown
InChI: InChI=1S/C20H17FO2/c1-10-14-8-9-16(22)20(23)18(14)11(2)13-7-6-12-4-3-5-15(21)19(12)17(10)13/h3-9,16,20,22-23H,1-2H3
charge 0 multiplicity 1
40 atoms
F  2.066873 2.364963 1.198169
O  -4.009892 -1.673314 0.962608
O  -5.725519 0.563076 0.329482
C  -2.047516 -0.442068 -0.088768
C  -3.569241 -0.590926 0.038322
C  -1.517186 0.885836 -0.314865
C  -1.185638 -1.554901 -0.165162
C  0.776731 0.015871 -0.122644
C  -0.116614 1.11278 -0.38983
C  0.23965 -1.326358 -0.173836
C  -4.279717 0.693532 0.514478
C  2.219094 0.164532 0.114238
C  -2.465897 1.993784 -0.550612
C  -3.782316 1.91152 -0.210727
C  1.153652 -2.440004 -0.307814
C  3.102551 -0.964021 -0.097717
C  -1.703523 -2.982293 -0.297333
C  0.392986 2.454721 -0.897705
C  2.521667 -2.258753 -0.355007
C  2.855814 1.317621 0.66646
C  4.517779 -0.823979 0.035358
C  4.236681 1.463503 0.81894
C  5.085762 0.384553 0.45597
H  -4.018618 -0.890391 -0.928559
H  -4.051661 0.807567 1.604573
H  -2.084161 2.917554 -0.993585
H  -4.489803 2.730969 -0.3720
H  0.745304 -3.448626 -0.408036
H  -2.799882 -3.021361 -0.300481
H  -1.333808 -3.434061 -1.237409
H  -1.357281 -3.628792 0.531812
H  0.27789 3.268274 -0.160975
H  1.456725 2.405733 -1.172858
H  -0.161587 2.74159 -1.810208
H  3.193542 -3.108801 -0.51932
H  -3.471817 -1.605367 1.793536
H  5.15257 -1.694097 -0.165225
H  -5.985165 -0.308452 0.730186
H  4.631245 2.387126 1.251703
H  6.170423 0.48896 0.557645
