program: Gaussian 09
title: 000187598
version: EM64L-G09RevD.01
frameworkgroup: C1[X(C11H12O2)]
method: RPBEPBE
basis: SDD
operation: Freq
keyword: #pfreq=noraman
keyword: PBEPBE/SDD
title: #p freq=noraman PBEPBE/SDD
converged: YES YES NO NO
title: Mulliken charges:
elementType: O O C C C C C C C C C C C H H H H H H H H H H H H
charge: -0.439373 -0.448228 -0.277266 0.207255 -0.125584 0.316454 -0.232731 -0.558483 -0.361004 0.464507 -0.414913 -0.410169 -0.811951 0.277855 0.203872 0.253277 0.270059 0.234374 0.235732 0.233313 0.335719 0.356365 0.226055 0.229358 0.235506
chargesum: 0.00000
title: Mulliken charges with hydrogens summed into heavy atoms:
elementType: O O C C C C C C C C C C C
charge: -0.103653 -0.091863 0.000589 0.207255 0.078288 0.316454 0.020546 -0.288424 -0.126629 0.464507 -0.179181 -0.176856 -0.121031
polarizability: 1.81029025e+02 5.77050658e+00 1.28942185e+02 -1.90999974e+00 -8.29575245e-01 6.66082074e+01
1716.lowfreq: -13.7014 -7.3426 0.0004 0.0005 0.0009 9.5398 39.6267 68.4930 110.0261
frequency: 39.3432 68.4826 110.0231 154.8062 199.4732 236.5331 270.7415 317.1156 328.4888 357.5422 373.0271 421.6929 444.0194 461.1171 476.7873 486.2648 534.4607 571.5398 648.9505 671.9609 704.9800 747.8479 789.1721 815.0007 849.9511 901.7498 923.6283 957.3993 965.1722 977.4435 979.6960 1003.4440 1027.8059 1047.7526 1073.7074 1126.4076 1154.7685 1163.8289 1177.9947 1219.7164 1227.2725 1240.0543 1248.5183 1283.7566 1318.0527 1348.2484 1356.8280 1373.2526 1396.0690 1396.5804 1424.1633 1472.0298 1473.5262 1493.8097 1571.0457 1620.8213 1643.9831 2854.7253 2973.9563 3013.4826 3055.0583 3085.5675 3117.7562 3124.4503 3128.4286 3141.9428 3166.0622 3524.5623 3527.9984
redmass: 1.0172 5.4883 3.7698 3.9166 4.0574 4.4219 4.2018 3.0485 2.2449 1.4032 6.1964 3.1929 4.7875 2.9513 1.4403 2.6368 3.3049 3.2682 4.6321 5.1722 2.4606 2.9490 2.4017 3.2341 1.5600 2.4376 1.6375 1.8656 1.6391 1.4820 4.1341 1.5230 3.5816 1.5688 2.5222 1.8421 1.4152 1.3419 1.2557 1.5613 1.5369 1.1982 2.0011 1.7088 1.3313 2.1481 1.2466 2.6088 2.0143 1.2410 3.6012 1.1208 1.0571 3.3166 6.2414 6.7562 7.4755 1.0796 1.0389 1.0833 1.0945 1.0998 1.0872 1.0878 1.0910 1.0969 1.0980 1.0652 1.0654
irintensity: 0.5149 0.7890 2.6320 2.5053 0.4356 9.0591 3.6399 2.8813 16.2304 46.8133 0.4941 2.0189 5.1479 16.6710 122.3880 91.9547 18.8001 11.6791 4.0359 0.2335 9.4132 5.4049 3.2747 6.3315 63.9268 22.8479 10.5016 4.0018 13.6333 15.7802 35.8493 3.4679 100.1006 20.6967 6.3398 1.9435 19.6073 4.9948 34.2263 60.3443 8.3090 17.1442 4.7100 4.9470 0.6072 9.8924 32.5850 12.4238 7.1453 6.9898 1.7052 14.7362 12.8914 22.5783 4.2511 8.4365 1.1720 59.5784 36.6407 10.3011 22.3094 17.3218 9.4507 12.6502 8.5825 25.9001 12.6926 13.4280 1.5090
temp: 298.150 k
press: 1.00000 atm
elementType: 8 8 6 6 6 6 6 6 6 6 6 6 6 1 1 1 1 1 1 1 1 1 1 1 1
symmnumber: 1
zpe: 528640.8 jmol-1
zpe.correction: 0.201349 hartree
zpe.thermalcorrener: 0.213167 hartree
zpe.thermalcorrenthalpy: 0.214111 hartree
zpe.thermalcorrgfe: 0.163422 hartree
zpe.sumelectzpe: -575.852039 hartree
zpe.sumelectthermal: -575.840220 hartree
zpe.sumelectthermalent: -575.839276 hartree
zpe.sumelectthermalfe: -575.889965 hartree
dipole: -2.8287 0.1584 1.5651
dipole: 3.2367
quadrupole: -78.7230 -70.8859 -78.0366
quadrupole: 0.2516 2.0186 -3.2597
quadrupole: -2.8412 4.9960 -2.1548 0.2516 2.0186 -3.2597
hfenergy: -576.0533875 hartree
pointgroup: C01 [X(C11H12O2)]
dipole: -1.0842995 0.1199059 0.6569255 debye
dipolederiv: -0.5765106 0.0186215 -0.0946088 0.0848042 -0.7623685 0.1042137 -0.13108 0.1360437 -0.1769383 -0.8409868 0.2522579 -0.0000266 0.2783265 -0.3098042 -0.0927931 0.0014927 -0.093113 -0.5371371 0.1815023 0.0471411 0.0181852 -0.0841582 0.5759907 -0.1002095 0.0482452 -0.1240301 0.2444821 -0.0433872 0.012091 -0.0570996 -0.1116398 -0.0667638 0.0513476 -0.1241014 0.074499 -0.0551288 0.5679108 -0.2690438 -0.0903629 -0.341813 0.1862641 0.0726319 -0.0813044 0.0171999 0.459983 0.0783206 0.0879788 0.0016796 0.0563597 -0.1082292 -0.0020099 0.0271078 0.0097047 0.029888 -0.1582096 -0.0366343 0.0239001 -0.0090759 0.0359412 -0.0620172 0.0979837 -0.0694115 -0.1934734 -0.2849969 -0.0813674 0.0038901 0.0610793 0.034724 0.0277134 0.0659011 0.0377928 -0.1659583 0.129146 0.0561092 -0.0034826 0.1876061 0.1486519 -0.028746 -0.071937 -0.0417742 -0.1791044 0.3081745 0.1812771 -0.0411327 0.2077982 0.0750372 -0.0269708 -0.1145248 -0.0615476 -0.0239902 -0.0387239 -0.0141905 -0.0209241 -0.0100823 0.1260962 0.0126218 0.017511 0.0170393 -0.1541109 -0.0096255 -0.079128 -0.0248916 -0.2538494 -0.0858937 0.0303407 -0.041159 0.0229497 -0.1680715 -0.0932675 -0.089223 0.0199292 -0.1146908 0.0107238 0.0110731 0.1379983 0.0653687 0.058094 0.0201776 0.0333356 0.0489778 0.0372329 0.0043289 -0.0115723 0.0160153 0.0054195 -0.0634838 -0.0109541 0.0122961 0.064425 0.1089848 -0.0280467 0.0730408 0.0328248 0.0269951 -0.2117226 -0.0213291 -0.0882574 -0.0031327 -0.0587613 0.0291448 0.0114378 -0.0087927 0.0309671 0.1589958 0.1067935 -0.0117673 -0.0019579 -0.0323698 -0.062971 -0.0158378 0.0019209 -0.0220652 0.1403597 0.0501715 0.041606 -0.0009615 -0.0412793 -0.1204339 0.0311963 0.0009717 0.0222872 0.1529573 0.0802602 -0.0290009 0.0038084 0.0017991 -0.1225493 -0.0133056 0.0054233 -0.0129188 0.1508195 -0.1012786 0.0921634 0.0243696 0.085483 0.0482455 -0.0148872 0.0248004 -0.0145062 0.1491478 0.304264 -0.0410532 0.0885547 -0.0152831 0.3071975 -0.095821 0.0978245 -0.0459837 0.0289412 0.3880586 -0.1068619 0.0298748 -0.035186 0.0860476 0.0326687 0.0392227 0.0406049 0.33128 -0.0859721 0.0393147 -0.0490201 0.1266795 0.00549 0.0560496 -0.0864556 0.0219332 0.0871207 0.0505836 0.0278406 0.0331341 -0.0507826 -0.0751529 -0.102602 -0.0392125 -0.1184848 0.0428899 -0.0001213 -0.0555054 0.0268723 -0.0771818 0.06833 0.0524373 0.0833239 0.0750306 -0.10584 unknown
polarizability: 181.1930623|2.9386608|128.4785449|-6.2083751|-0.6487472|66.9078107 unknown
InChI: InChI=1S/C11H12O2/c1-7-2-3-8-4-5-10(12)11(13)9(8)6-7/h2-6,10-13H,1H3
charge 0 multiplicity 1
25 atoms
O  1.243817 -2.411989 -0.046357
O  3.701927 -0.830866 -0.283383
C  1.243868 -0.989472 -0.455388
C  -0.078414 -0.272961 -0.194871
C  2.43855 -0.272137 0.205422
C  -0.061165 1.155199 -0.108327
C  2.414866 1.214674 -0.070358
C  -1.299832 -0.970984 -0.133007
C  1.226142 1.872062 -0.186648
C  -2.535087 -0.287267 0.034643
C  -1.293929 1.838541 0.032274
C  -2.511143 1.128358 0.107287
C  -3.840513 -1.054838 0.143243
H  1.440301 -1.043212 -1.543989
H  2.36098 -0.434856 1.311467
H  3.380917 1.728663 -0.102381
H  -1.291671 -2.062731 -0.236184
H  1.202384 2.96087 -0.316082
H  -1.297147 2.933987 0.086432
H  -3.453933 1.677314 0.218761
H  0.940718 -2.461078 0.898147
H  3.613448 -1.820007 -0.244694
H  -4.695094 -0.452056 -0.210856
H  -3.812475 -1.98858 -0.445714
H  -4.050912 -1.336733 1.193663
