program: Gaussian 09
title: 000187593
version: EM64L-G09RevD.01
frameworkgroup: C1[X(C14H8ClF5O)]
method: RPBEPBE
basis: SDD
operation: Freq
keyword: #p
keyword: freq=noraman
keyword: PBEPBE/SDD
title: #p freq=noraman PBEPBE/SDD
converged: NO YES NO NO
title: Mulliken charges:
elementType: Cl F F F F F O C C C C C C C C C C C C C C H H H H H H H H
charge: -0.059298 -0.148879 -0.148919 -0.142404 -0.142403 -0.139994 -0.268322 0.230879 -0.388693 0.385361 0.131359 0.130920 0.566648 -0.561582 0.060483 0.060472 -0.350755 0.125873 -0.304216 -0.206333 -0.794905 0.237576 0.237521 0.261356 0.254685 0.253561 0.247124 0.247127 0.225757
chargesum: 0.00000
title: Mulliken charges with hydrogens summed into heavy atoms:
elementType: Cl F F F F F O C C C C C C C C C C C C C C
charge: -0.059298 -0.148879 -0.148919 -0.142404 -0.142403 -0.139994 -0.268322 0.230879 0.086404 0.385361 0.131359 0.130920 0.566648 -0.300225 0.060483 0.060472 -0.096070 0.125873 -0.304216 0.047228 -0.074897
polarizability: 2.58071522e+02 1.69860794e-02 1.24126017e+02 9.34505874e+00 -1.14763418e-01 1.28934123e+02
1716.lowfreq: -3.4306 -0.0023 -0.0009 0.0016 3.7505 4.5550 11.1403 21.3606 33.6013
frequency: 10.5229 21.2852 33.5949 67.4399 107.7561 113.3287 119.7735 125.1863 127.1910 161.1294 211.8955 213.4704 229.8973 253.6065 257.9868 281.6015 287.0609 296.1967 317.4727 323.4471 346.6411 372.3525 407.0631 426.5355 441.3354 451.4824 497.0831 532.5592 543.5530 567.4895 590.8119 606.7449 632.4220 675.4397 699.2987 702.0922 721.6290 769.3827 795.3531 880.3755 884.6381 893.4802 924.6254 931.1180 968.2961 1014.3158 1022.8277 1030.7851 1047.1633 1073.0564 1088.9862 1147.5334 1163.7676 1220.9253 1234.9692 1238.4855 1274.4542 1364.1366 1373.0458 1383.2978 1392.4766 1401.4474 1414.5781 1458.3596 1458.8879 1460.4833 1468.9552 1473.6945 1481.8598 1579.2812 1609.6321 1615.7006 1628.3858 2988.3898 2990.8535 3051.9034 3068.4099 3100.5686 3156.6848 3157.6745 3176.4760
redmass: 8.1587 6.9482 10.7396 6.6589 9.7202 1.0557 12.2586 7.2043 13.7496 16.5380 12.8075 3.3669 4.9917 12.8049 18.4574 3.0600 10.7033 5.8326 11.2146 6.5525 9.4270 12.5983 8.9061 14.4101 2.9037 10.8564 4.4374 7.2140 9.3934 3.3847 7.9910 8.5249 12.1610 8.3214 4.3678 3.9516 8.5122 9.7761 1.3968 1.4958 4.7927 5.8797 1.3584 8.4447 2.8673 1.9752 4.5466 2.1675 1.5284 7.7832 7.7820 1.6189 1.6612 1.1313 2.5870 6.6895 1.7201 2.0124 8.7260 2.5162 9.3439 1.2619 2.7548 2.3775 8.7333 1.0539 10.5414 1.1271 1.2885 6.3927 10.6220 7.2828 11.8901 1.0369 1.0557 1.1080 1.0972 1.1000 1.0886 1.0912 1.0968
irintensity: 0.0584 0.0560 0.1914 0.8706 0.7623 0.7951 0.7551 2.1743 0.1017 0.0597 2.8817 1.0524 1.2825 0.6749 0.0588 6.6977 0.0501 3.4481 3.9375 1.6330 0.8904 0.0031 4.0632 0.0129 7.8240 0.9870 0.9660 2.6579 0.3331 3.4872 0.1467 26.6457 0.0012 39.7769 0.2036 0.4291 4.7244 41.4062 34.2417 7.2788 127.3584 6.9974 1.0241 63.3110 48.2379 63.0523 56.1340 47.6242 10.7989 0.0812 44.2645 138.7957 86.9791 13.4810 62.4129 45.4292 104.5323 16.2022 6.8476 38.4904 64.5313 21.9097 1.1186 53.8477 229.3655 27.9060 85.9794 45.2322 83.0463 45.8390 0.4761 41.2005 28.2324 18.8972 26.1950 7.4328 12.5579 16.1674 10.0259 2.3425 7.0389
temp: 298.150 k
press: 1.00000 atm
elementType: 17 9 9 9 9 9 8 6 6 6 6 6 6 6 6 6 6 6 6 6 6 1 1 1 1 1 1 1 1
symmnumber: 1
zpe: 488280.3 jmol-1
zpe.correction: 0.185976 hartree
zpe.thermalcorrener: 0.205459 hartree
zpe.thermalcorrenthalpy: 0.206403 hartree
zpe.thermalcorrgfe: 0.135156 hartree
zpe.sumelectzpe: -1571.233137 hartree
zpe.sumelectthermal: -1571.213654 hartree
zpe.sumelectthermalent: -1571.212710 hartree
zpe.sumelectthermalfe: -1571.283956 hartree
dipole: -0.2130 0.0058 -1.3557
dipole: 1.3723
quadrupole: -146.2185 -136.8502 -112.9771
quadrupole: 0.0195 -7.2318 -0.0800
quadrupole: -14.2032 -4.8349 19.0381 0.0195 -7.2318 -0.0800
hfenergy: -1571.4191129 hartree
pointgroup: C01 [X(C14H8Cl1F5O1)]
dipole: 0.072617 -0.0026343 0.534996 debye
polarizability: 257.6241778|0.0146057|124.1242111|12.0372959|0.0785013|129.3832736 unknown
InChI: InChI=1S/C14H8ClF5O/c1-6-4-7(2-3-9(6)15)21-5-8-10(16)12(18)14(20)13(19)11(8)17/h2-4H,5H2,1H3
charge 0 multiplicity 1
29 atoms
Cl 6.772092 0.006344 0.451766
F  -1.571548 -2.421907 0.530878
F  -1.582091 2.41827 0.563787
F  -4.170759 2.420283 -0.447822
F  -4.160181 -2.421447 -0.480882
F  -5.463503 0.000075 -0.977027
O  0.771139 0.005381 -0.13192
C  -1.517137 -0.001809 0.562559
C  -0.09505 -0.002301 1.064559
C  2.1635 0.00522 0.09637
C  -2.202841 -1.203567 0.287899
C  -2.208044 1.200581 0.304222
C  4.369516 0.012447 -1.008235
C  2.958199 0.011847 -1.074814
C  -3.5198 1.218836 -0.206456
C  -3.514493 -1.220577 -0.223054
C  2.767814 -0.000918 1.375383
C  -4.172953 -0.000539 -0.47275
C  4.950029 0.006114 0.287759
C  4.178903 -0.000414 1.460792
C  5.209511 0.019515 -2.268183
H  0.101325 0.899166 1.675275
H  0.104021 -0.909733 1.665522
H  2.454902 0.016558 -2.046706
H  2.180308 -0.005951 2.297421
H  4.668841 -0.005111 2.438628
H  5.868258 0.906351 -2.301586
H  5.869525 -0.865985 -2.310666
H  4.572524 0.023671 -3.167714
