program: Gaussian 09
title: 000185134
version: EM64L-G09RevD.01
frameworkgroup: C1[X(C18H24ClN3O)]
method: RPBEPBE
basis: SDD
operation: Freq
keyword: #p
keyword: freq=noraman
keyword: PBEPBE/SDD
title: #p freq=noraman PBEPBE/SDD
converged: YES YES NO NO
title: Mulliken charges:
elementType: Cl O N N N C C C C C C C C C C C C C C C C C C H H H H H H H H H H H H H H H H H H H H H H H H
charge: -0.076869 -0.345176 -0.457886 -0.092675 -0.054022 -0.468127 -0.032975 -0.404140 -0.383890 -0.709325 0.362101 -0.395957 0.249755 0.274119 -0.337545 -0.638375 -0.029573 -0.348546 -0.783427 -0.396242 -0.305600 -0.289898 -0.090686 0.212438 0.222654 0.210067 0.218135 0.249662 0.242417 0.214344 0.370660 0.218872 0.208487 0.245426 0.232405 0.244304 0.228122 0.225052 0.223012 0.223622 0.258581 0.263347 0.248695 0.235374 0.228254 0.283041 0.247991
chargesum: 0.00000
title: Mulliken charges with hydrogens summed into heavy atoms:
elementType: Cl O N N N C C C C C C C C C C C C C C C C C C
charge: -0.076869 -0.345176 -0.087226 -0.092675 -0.054022 -0.033036 0.177092 0.063657 0.072870 -0.036539 0.362101 0.080752 0.249755 0.274119 -0.109422 0.033311 -0.029573 -0.089965 -0.036011 -0.167988 -0.022559 -0.041908 -0.090686
polarizability: 2.87955496e+02 -3.01845561e+01 2.78371613e+02 1.25167822e+01 1.87577023e+01 1.52757512e+02
1716.lowfreq: -6.2689 -4.1579 -0.0007 -0.0005 -0.0003 3.8922 20.8519 26.2136 42.7824
frequency: 20.8055 26.1320 42.7765 56.3160 60.3810 80.3538 84.8543 100.5649 116.7371 129.5602 139.3244 159.3995 167.1448 196.6592 202.8162 206.1694 224.0933 238.6295 248.2334 264.3817 274.9639 294.7050 327.7416 361.9361 384.0170 398.2520 422.9802 427.4346 452.1088 475.1668 486.5509 500.9742 505.6969 526.3383 564.4031 576.3759 611.1734 614.7129 640.6316 647.0105 665.3680 687.6259 746.5501 754.3938 775.8409 789.3582 818.9823 823.7195 828.0763 852.3885 862.9455 886.0617 892.0375 935.2479 942.0057 947.2384 961.3610 964.4866 992.9351 1000.3975 1030.7392 1035.0749 1048.6400 1063.6783 1069.7420 1080.9571 1097.5398 1101.8977 1117.0002 1146.6886 1157.6361 1169.7776 1183.0488 1208.3358 1219.5503 1257.3482 1266.8050 1272.4221 1289.2207 1300.2127 1316.1962 1322.5497 1328.3281 1341.2701 1347.0711 1355.6822 1356.7340 1374.8819 1381.5631 1385.8084 1391.3779 1391.6323 1424.2474 1429.4873 1445.4109 1448.5652 1457.9033 1462.1215 1465.0192 1468.2848 1471.1489 1479.1946 1480.5962 1481.6610 1489.8898 1497.0128 1535.0332 1562.6825 1572.2762 1581.4994 1610.3862 2946.2410 2980.4766 2986.4884 2986.5193 2994.3708 2995.7754 2999.0673 3006.8699 3041.3200 3058.7277 3070.1005 3073.3159 3078.2068 3082.1809 3087.2602 3088.8121 3096.3428 3110.5336 3127.6685 3130.2935 3166.5379 3172.3579 3181.3561 3412.9722
redmass: 4.8767 4.5662 3.7582 3.5496 4.2949 4.0632 3.1470 4.6405 3.5263 4.1071 3.8249 2.7779 1.2713 2.3193 1.9416 1.3238 1.6610 3.9968 3.8445 5.3048 2.7981 4.3869 2.3777 5.1947 2.5340 3.5995 3.1509 2.9570 3.6450 2.8888 3.3943 3.3911 3.1888 5.5515 3.4400 7.5016 3.2710 4.4349 4.8982 3.2803 1.4393 2.0524 4.4409 1.7289 2.4362 1.1910 1.4415 1.7395 3.9720 3.4622 1.7527 3.2052 1.5137 2.2532 2.0056 1.4194 1.3414 1.8457 2.5461 2.2022 1.7902 1.6763 2.8251 1.8980 2.7494 2.1165 2.4680 2.1144 2.0668 2.1256 1.9444 1.7465 2.6168 2.1189 1.4544 1.3707 1.3651 1.3328 1.1738 1.4157 1.5372 2.0006 1.9328 1.3626 1.2651 1.3381 1.3993 2.6650 1.2147 1.2239 3.7967 1.3208 2.7630 2.6083 1.1904 2.0847 1.1246 1.0711 1.1076 1.0461 1.1090 1.0852 1.0538 1.1099 2.0566 1.1785 5.1651 3.2824 2.6993 6.1942 5.2068 1.0834 1.0377 1.0578 1.0370 1.0386 1.0635 1.0619 1.0667 1.0983 1.1014 1.0978 1.1012 1.0998 1.0975 1.0992 1.0997 1.1010 1.0897 1.0905 1.0984 1.0951 1.0927 1.0931 1.0802
irintensity: 1.4611 0.8390 0.3416 1.2792 0.3147 0.2695 0.8448 0.3090 3.5946 0.4482 15.9438 1.6761 1.1886 1.2634 0.9792 0.3512 0.1955 0.6303 2.8151 1.4660 5.2297 2.2060 0.1378 2.5501 2.1003 2.9012 8.8863 1.5079 0.4097 7.6275 10.8548 0.0375 1.1467 1.7143 9.6195 18.1205 6.1119 13.0405 16.2580 2.0547 98.4174 14.7124 2.0382 5.6808 30.2339 13.9475 84.9034 1.0937 24.2035 49.3973 8.3241 19.9624 22.6729 6.6990 1.4841 0.6939 17.2844 4.3863 11.3955 18.4992 15.8162 5.3745 0.7760 9.6942 1.5293 7.1509 12.3086 11.5868 6.7706 2.1472 64.2883 6.9747 22.2343 10.9347 9.9230 6.6247 2.4539 34.4911 5.6075 6.3888 3.2511 12.6749 27.0935 62.5311 16.8707 12.7424 5.3946 12.3604 27.1464 30.2207 54.3456 22.8589 7.5459 90.0519 83.2094 89.0065 10.7223 28.1560 15.9174 7.8160 34.2789 6.7846 18.0855 13.7100 9.8205 21.4944 56.9516 576.2146 58.1397 330.3474 79.4392 26.2756 18.8892 32.1938 26.1459 6.1925 21.9351 44.4900 23.8743 7.2753 26.5799 7.5693 22.9182 62.7734 14.3139 41.4849 28.6841 45.9217 36.9923 10.3040 13.5937 3.1116 25.8063 0.4830 380.2273
temp: 298.150 k
press: 1.00000 atm
elementType: 17 8 7 7 7 6 6 6 6 6 6 6 6 6 6 6 6 6 6 6 6 6 6 1 1 1 1 1 1 1 1 1 1 1 1 1 1 1 1 1 1 1 1 1 1 1 1
symmnumber: 1
zpe: 1022993.5 jmol-1
zpe.correction: 0.389638 hartree
zpe.thermalcorrener: 0.413076 hartree
zpe.thermalcorrenthalpy: 0.414021 hartree
zpe.thermalcorrgfe: 0.335515 hartree
zpe.sumelectzpe: -1398.159724 hartree
zpe.sumelectthermal: -1398.136285 hartree
zpe.sumelectthermalent: -1398.135341 hartree
zpe.sumelectthermalfe: -1398.213847 hartree
dipole: -11.2496 -0.7512 0.9653
dipole: 11.3159
quadrupole: -147.0149 -133.1976 -148.8831
quadrupole: 7.1291 -9.2897 -2.7308
quadrupole: -3.9830 9.8343 -5.8513 7.1291 -9.2897 -2.7308
hfenergy: -1398.5493614 hartree
pointgroup: C01 [X(C18H24Cl1N3O1)]
dipole: -4.3163015 -1.0802948 -0.1511245 debye
polarizability: 269.304831|24.3883146|297.2524881|-23.3264654|-8.8515006|152.5273022 unknown
InChI: InChI=1S/C18H24ClN3O/c1-4-22(14(3)23)11-5-6-13(2)21-17-9-10-20-18-12-15(19)7-8-16(17)18/h7-10,12-13,21H,4-6,11H2,1-3H3
charge 0 multiplicity 1
47 atoms
Cl 3.504202 4.538916 -0.501321
O  -2.080025 0.550616 1.046482
N  0.117956 -1.435101 0.601503
N  -3.898845 0.169144 -0.330172
N  3.90885 -0.585002 -1.232677
C  -1.961696 -2.676164 0.993474
C  -0.433429 -2.796092 0.7763
C  -2.722058 -2.096434 -0.22891
C  -3.958508 -1.233086 0.171157
C  0.234659 -3.540637 1.959449
C  1.343024 -1.161664 0.028348
C  -4.92313 0.603469 -1.310039
C  1.829009 0.212016 -0.077867
C  -2.930134 0.999642 0.195828
C  2.186283 -2.178704 -0.488005
C  -6.282063 0.943142 -0.658704
C  3.110408 0.432825 -0.719095
C  1.106801 1.341067 0.423469
C  -2.873852 2.452184 -0.267971
C  3.422614 -1.838171 -1.096291
C  3.611423 1.770757 -0.843264
C  1.610708 2.641111 0.298601
C  2.865426 2.830881 -0.342883
H  -2.355931 -3.673489 1.265015
H  -2.124678 -2.0155 1.86767
H  -0.251896 -3.370866 -0.157765
H  -3.036929 -2.916694 -0.901859
H  -2.030773 -1.461732 -0.812027
H  -4.037616 -1.200178 1.274059
H  -4.89483 -1.670047 -0.217767
H  -0.499811 -0.66523 0.892052
H  -0.018936 -3.044748 2.914056
H  -0.11464 -4.588958 2.007218
H  1.333862 -3.54544 1.862186
H  -5.052684 -0.210953 -2.047715
H  -4.543443 1.474676 -1.868353
H  1.903392 -3.232419 -0.435189
H  -7.017107 1.229663 -1.432727
H  -6.182942 1.782383 0.052529
H  -6.688392 0.07659 -0.107019
H  0.136523 1.215336 0.917304
H  -2.176041 2.987249 0.392514
H  -2.489831 2.524557 -1.302613
H  -3.856996 2.952666 -0.230075
H  4.055697 -2.639859 -1.498045
H  4.578737 1.908025 -1.332573
H  1.058243 3.499054 0.692315
