program: Gaussian 09
title: 000187585
version: EM64L-G09RevD.01
frameworkgroup: C1[X(C13H4Cl3F5O)]
method: RPBEPBE
basis: SDD
operation: Freq
keyword: #p
keyword: freq=noraman
keyword: PBEPBE/SDD
title: #p freq=noraman PBEPBE/SDD
converged: YES YES NO NO
title: Mulliken charges:
elementType: Cl Cl Cl F F F F F O C C C C C C C C C C C C C H H H H
charge: 0.007403 0.007389 -0.023240 -0.146686 -0.146596 -0.142933 -0.142903 -0.139129 -0.263671 0.257291 -0.392098 0.128812 0.129317 0.571638 0.068790 0.068874 0.123405 -0.246948 -0.246928 -0.225930 -0.225995 -0.090399 0.248016 0.248051 0.287231 0.287240
chargesum: 0.00000
title: Mulliken charges with hydrogens summed into heavy atoms:
elementType: Cl Cl Cl F F F F F O C C C C C C C C C C C C C
charge: 0.007403 0.007389 -0.023240 -0.146686 -0.146596 -0.142933 -0.142903 -0.139129 -0.263671 0.257291 0.103969 0.128812 0.129317 0.571638 0.068790 0.068874 0.123405 -0.246948 -0.246928 0.061301 0.061244 -0.090399
polarizability: 2.65819097e+02 1.26375107e-02 1.94385660e+02 1.26519572e+01 1.67788972e-02 7.44100563e+01
1716.lowfreq: -9.7953 -3.5452 -3.0530 0.0015 0.0018 0.0023 7.7883 21.3370 25.7580
frequency: 5.0694 21.1580 25.7561 34.5583 55.6478 108.8847 121.1507 126.4535 149.2056 174.0093 174.7229 186.8521 194.4122 220.1226 244.1293 256.7340 257.9405 277.8015 287.0029 308.1704 332.3019 348.8554 371.5743 395.2831 405.7687 407.6226 426.5740 461.0568 504.0265 536.2571 538.9950 556.2077 590.9905 625.1171 632.0381 689.1074 696.4309 731.0068 750.8265 754.5317 823.3704 852.0631 859.6387 880.4827 890.5863 931.1674 1018.1320 1044.5251 1073.7049 1090.8564 1105.7492 1179.4745 1207.4290 1213.1172 1240.5009 1339.6140 1354.0846 1370.6089 1371.2934 1393.2418 1423.7290 1458.2401 1468.9893 1471.5534 1551.0545 1571.2534 1608.3040 1626.5412 3014.5593 3081.0680 3186.6039 3187.9516
redmass: 15.1075 13.3093 19.1828 12.1086 17.9819 18.2984 18.5668 14.6838 13.3594 23.2300 11.0913 19.8622 4.9146 12.7420 4.0358 13.3158 18.5112 5.1873 15.3711 14.1013 12.2234 31.2265 12.6193 10.8787 10.0280 7.9961 14.6565 13.3803 5.0498 12.7604 7.1626 4.8660 6.1948 10.5282 12.1599 8.8289 5.6916 8.8686 11.7967 11.2591 8.8748 1.4257 1.3655 4.9792 9.5933 8.9201 2.2367 3.6112 8.7607 8.5263 2.7221 1.5109 1.1262 3.7804 8.3667 5.7606 1.3395 4.6171 8.8814 10.4911 3.0945 9.5688 10.0331 1.1326 9.6106 7.9953 10.6945 11.9186 1.0562 1.1099 1.0932 1.0940
irintensity: 0.0928 0.0778 0.0108 1.0144 0.1236 0.4412 0.0064 0.3209 0.1011 0.1252 0.5158 0.4575 0.0550 2.9082 4.4795 0.5301 0.0488 0.5690 1.0154 6.6381 1.6249 0.0276 0.0000 3.5689 4.6658 4.9615 0.0033 0.4384 0.0045 4.3896 4.8587 11.1540 15.8731 0.4406 0.0035 25.3025 0.4251 9.8949 112.1889 63.6856 9.1778 42.2351 0.0495 88.2147 77.8277 37.7131 49.8213 21.6846 0.9066 60.4585 40.8884 4.3419 15.1269 120.4780 33.9235 13.8236 79.8504 25.0053 3.5048 79.6043 112.3122 219.4639 103.4304 8.8230 61.8411 50.6015 0.0898 37.3309 22.6669 2.4904 2.8210 0.7975
temp: 298.150 k
press: 1.00000 atm
elementType: 17 17 17 9 9 9 9 9 8 6 6 6 6 6 6 6 6 6 6 6 6 6 1 1 1 1
symmnumber: 1
zpe: 364106.4 jmol-1
zpe.correction: 0.138681 hartree
zpe.thermalcorrener: 0.159256 hartree
zpe.thermalcorrenthalpy: 0.160201 hartree
zpe.thermalcorrgfe: 0.084669 hartree
zpe.sumelectzpe: -2450.767503 hartree
zpe.sumelectthermal: -2450.746928 hartree
zpe.sumelectthermalent: -2450.745984 hartree
zpe.sumelectthermalfe: -2450.821515 hartree
dipole: 1.9631 0.0005 2.1017
dipole: 2.8759
quadrupole: -152.6188 -150.5761 -140.7851
quadrupole: -0.0026 -2.8836 0.0236
quadrupole: -4.6255 -2.5828 7.2083 -0.0026 -2.8836 0.0236
hfenergy: -2450.906184 hartree
pointgroup: C01 [X(C13H4Cl3F5O1)]
dipole: -0.7750169 0.0001911 -0.8243741 debye
dipolederiv: -0.2467559 0.2361117 -0.011977 0.2544083 -0.5454857 0.0268814 0.015455 0.010593 -0.0285005 -0.245556 -0.2352728 -0.0116818 -0.2534555 -0.5469161 -0.026507 0.0158198 -0.0101753 -0.0285105 -0.8965557 -0.0010162 -0.0146987 -0.0010913 -0.1217565 0.0000052 -0.0294359 -0.0000246 -0.0470357 -0.3450367 -0.2595109 -0.070246 -0.2428049 -0.6944378 -0.1006556 -0.0650989 -0.0966097 -0.1226425 -0.3456449 0.2603067 -0.0690888 0.2435715 -0.6946284 0.0978165 -0.0642025 0.0940423 -0.1217249 -0.4105264 -0.3305632 -0.0730101 -0.4372507 -0.7194016 -0.0947158 -0.0983012 -0.0930544 -0.1008255 -0.4116169 0.3313418 -0.071712 0.438124 -0.7191435 0.0918931 -0.0965086 0.0901625 -0.0999876 -1.0361771 -0.0001455 -0.2337724 -0.0000369 -0.150324 -0.0001836 -0.2836249 -0.0002135 -0.1483538 -1.6202267 -0.0015586 0.1799782 -0.0023399 -0.2748293 0.000299 0.2148092 0.0003311 -0.2899045 -0.2649367 -0.0000903 -0.0104851 0.0002163 -0.1771004 -0.0002202 -0.0695781 -0.0001636 -0.1291081 1.1059255 0.0008023 -0.1166722 0.0013728 0.2389343 -0.0005138 -0.4499577 -0.0008252 0.4907412 0.44692 0.3889843 0.0902345 0.1596714 0.7485133 0.1007797 0.0606056 0.1184774 0.1199535 0.4479052 -0.389818 0.088486 -0.1605267 0.748824 -0.0976293 0.0597387 -0.1157822 0.1189749 1.1089693 0.001781 -0.1128687 0.0021251 -0.2839058 0.0001052 0.1632002 0.0003354 0.0256091 0.239808 0.5093658 0.0341071 0.5822596 0.7328858 0.128074 0.0608519 0.1504615 0.0760435 0.2414383 -0.5102215 0.0320484 -0.5832166 0.7325647 -0.125206 0.0584516 -0.1473736 0.0748727 1.1518952 0.0001177 0.2747463 0.0000861 0.1416271 0.0001685 0.3108416 0.0001454 0.1705663 0.3007375 -0.3258582 0.0461916 -0.3576792 0.8316213 -0.0337158 0.0074483 -0.0077929 -0.064773 0.2988051 0.3244696 0.0457791 0.3562038 0.8334964 0.033072 0.0069786 0.0072021 -0.064797 -0.4909995 0.1294287 -0.0020829 0.1375886 -0.2192477 0.0068862 -0.0120474 0.0003548 -0.0638848 -0.490237 -0.1300831 -0.0019537 -0.1383033 -0.2199874 -0.0067168 -0.0119659 -0.0002716 -0.0638953 1.3348188 0.001428 0.0327166 0.0015019 0.261658 -0.0000582 0.0492618 -0.000021 -0.0618659 -0.0123026 0.0275064 -0.0106676 0.0094621 -0.0018749 0.1096888 0.0834646 0.0229709 0.005811 -0.0121711 -0.0275595 -0.0104547 -0.0099625 -0.0016379 -0.1096109 0.0834013 -0.0228442 0.005521 0.0758259 -0.0269865 -0.0014439 -0.0293993 0.0502066 -0.0006511 -0.0047947 -0.0008123 0.1738549 0.0756945 0.0270402 -0.0014722 0.0294752 0.0503456 0.0007146 -0.0048124 0.0008876 0.1738616 unknown
polarizability: 265.8989018|0.0346045|194.385628|12.0327299|0.0827472|74.3302839 unknown
InChI: InChI=1S/C13H4Cl3F5O/c14-4-1-6(15)13(7(16)2-4)22-3-5-8(17)10(19)12(21)11(20)9(5)18/h1-2H,3H2
charge 0 multiplicity 1
26 atoms
Cl -2.026306 -2.78019 0.210615
Cl -2.033907 2.782342 0.2090
Cl -6.830412 -0.005486 0.042849
F  1.495884 -2.416838 -0.554309
F  1.492491 2.425734 -0.543777
F  4.151126 2.424754 0.254249
F  4.154532 -2.415542 0.243841
F  5.487532 0.0047 0.655601
O  -0.798317 0.002762 0.359509
C  1.428681 0.004421 -0.554758
C  -0.027743 0.004252 -0.932213
C  2.13759 -1.198509 -0.349038
C  2.135835 1.207506 -0.343795
C  -2.192107 0.000851 0.207809
C  3.484906 1.224343 0.058259
C  3.486627 -1.215288 0.053075
C  4.160524 0.004587 0.259903
C  -2.929021 -1.211249 0.175441
C  -2.932295 1.210916 0.174836
C  -4.335904 -1.235799 0.127264
C  -4.3393 1.231706 0.12666
C  -5.016112 -0.002945 0.103376
H  -0.291458 0.91256 -1.502195
H  -0.290812 -0.902995 -1.504122
H  -4.878917 -2.183411 0.110868
H  -4.884714 2.17792 0.109751
