program: Gaussian 09
title: 000187639
version: EM64L-G09RevD.01
frameworkgroup: C1[X(C23H31NO3S)]
method: RPBEPBE
basis: SDD
operation: Freq
keyword: #p
keyword: freq=noraman
keyword: PBEPBE/SDD
title: #p freq=noraman PBEPBE/SDD
converged: YES YES NO NO
title: Mulliken charges:
elementType: S O O O N C C C C C C C C C C C C C C C C C C C C C C C H H H H H H H H H H H H H H H H H H H H H H H H H H H H H H H
charge: 0.829010 -0.312485 -0.532264 -0.536734 -0.364154 0.010279 -0.417672 -0.361641 -0.241243 -0.299145 0.600247 0.485384 -0.743323 -0.222262 -0.400455 0.583341 -0.387836 -0.245245 -0.499665 -0.437767 -0.409516 -0.689248 -0.700485 -0.691711 -0.692175 -0.228496 -0.243191 -0.240667 0.240103 0.243415 0.297610 0.225693 0.228256 0.272768 0.234507 0.231914 0.266617 0.264707 0.306560 0.239113 0.211768 0.238846 0.254946 0.305083 0.216836 0.203470 0.251796 0.199600 0.222084 0.236223 0.228437 0.217404 0.214322 0.211204 0.217736 0.228646 0.225723 0.226860 0.226872
chargesum: 0.00000
title: Mulliken charges with hydrogens summed into heavy atoms:
elementType: S O O O N C C C C C C C C C C C C C C C C C C C C C C C
charge: 0.829010 -0.312485 -0.532264 -0.536734 -0.364154 0.250382 0.123353 0.092307 0.031526 -0.299145 0.600247 0.485384 -0.010285 0.042445 -0.093895 0.583341 -0.148723 -0.033478 -0.260819 -0.182821 -0.104433 -0.017146 -0.042578 -0.031548 -0.034589 -0.002773 -0.016331 -0.013796
polarizability: 3.62198215e+02 7.76823241e+00 3.17181669e+02 7.62671863e+00 -4.55866535e+00 2.08925493e+02
1716.lowfreq: -8.6196 -4.6310 -0.0012 -0.0010 0.0004 4.7127 13.0566 17.8264 23.5583
frequency: 10.5620 17.7737 23.4084 28.6706 33.4115 43.5289 54.5524 66.7128 69.5348 80.9881 84.2965 106.8338 117.1349 141.9379 148.4468 169.8805 183.0063 197.4641 208.1165 211.5588 220.0814 222.4790 226.2253 230.5879 241.6412 244.7140 250.5439 255.6156 263.1281 299.5086 305.1604 317.2525 324.9355 332.5886 393.9130 398.6649 403.5136 408.0887 431.4242 444.2015 456.0814 472.8085 481.1564 496.8345 535.1589 564.6978 576.6281 613.0928 626.1937 629.4831 658.5918 672.8805 684.0635 712.0496 732.8941 748.0864 779.8630 781.4587 804.4833 807.8262 809.7830 851.1898 867.9592 880.5755 890.9349 896.1729 900.8612 917.3488 921.3360 935.0698 939.5860 956.2133 960.3501 963.5771 973.0961 986.2800 989.2705 996.9547 998.6920 1013.4471 1023.8150 1031.0687 1038.3212 1060.1065 1063.1705 1075.5488 1084.0181 1089.2253 1109.7720 1111.4399 1113.5245 1121.4673 1126.2533 1145.3769 1150.5052 1172.3079 1173.0036 1200.2840 1207.5342 1209.5056 1223.6715 1231.8320 1258.6299 1261.5728 1287.2340 1287.7916 1299.8230 1306.0645 1307.4479 1334.6264 1351.1457 1354.0843 1375.5414 1377.9180 1384.0092 1388.5407 1391.4079 1395.8204 1398.2194 1400.3017 1406.5456 1443.8709 1457.5158 1462.4185 1465.7593 1466.8252 1467.4417 1467.5399 1471.9459 1477.3550 1479.9210 1480.9128 1483.8608 1486.1361 1491.2768 1492.0868 1553.4670 1589.9668 1611.0195 1611.4596 2959.9158 2964.9300 2973.7052 2976.5207 2976.7909 2979.9043 2983.9286 2995.6332 3021.3909 3030.2309 3065.8165 3067.0042 3068.8960 3073.5659 3078.5062 3079.1567 3083.0335 3085.6211 3089.0842 3092.7938 3099.8822 3108.7458 3116.2820 3121.1002 3121.9697 3131.8664 3142.9336 3146.4933 3149.7319 3159.7678 3174.8598
redmass: 3.1171 2.6996 5.0373 4.3553 4.6031 4.9721 4.2862 3.1585 3.9453 4.8544 4.0659 4.5466 4.6002 3.7185 3.7232 3.8375 4.7361 2.6315 2.6596 1.6382 1.1423 2.0537 1.9011 2.4613 1.8318 2.1781 1.6821 1.4953 3.1991 3.4362 5.0446 2.6692 4.6907 3.2715 5.3437 3.9627 3.5144 2.9471 3.4438 3.2541 2.8665 3.4507 3.7682 5.6747 3.6092 2.9088 3.5039 5.7481 4.0587 3.8644 6.3168 3.1247 6.0036 1.8459 3.0357 3.7826 2.2710 5.7137 5.5202 3.2810 3.0303 1.4236 1.2697 2.1869 2.5712 2.7183 3.8710 1.1805 1.3181 1.3687 1.4059 1.4405 1.4283 1.5846 1.3815 3.0660 1.4948 2.2307 3.0485 1.3448 1.5530 2.0443 2.7788 1.6536 1.5249 1.7311 1.8722 1.6059 1.4092 2.5088 2.2197 1.9980 2.2495 1.9955 2.0701 1.4955 1.0628 1.2018 1.6065 1.8922 2.6046 1.4939 1.5155 1.2872 1.5703 1.4958 2.0895 1.3351 1.2819 1.2600 1.2552 1.5922 1.1907 1.1948 4.9614 2.3525 1.8461 1.2158 1.3528 1.2192 1.9145 2.0924 1.0724 1.1080 1.0480 1.2237 1.1179 1.0510 1.3120 1.1965 1.0502 1.0561 1.9312 1.0548 1.2333 1.1522 5.8275 5.8336 6.7725 5.9883 1.0590 1.0827 1.0352 1.0357 1.0353 1.0358 1.0839 1.0363 1.1014 1.0844 1.0996 1.0529 1.0997 1.0988 1.0981 1.1007 1.1001 1.1005 1.0990 1.0999 1.0913 1.1000 1.0861 1.0878 1.0882 1.0923 1.0959 1.0912 1.0943 1.1014 1.1188
irintensity: 0.3352 0.0129 0.1929 0.7119 0.1414 0.6138 0.4861 0.3620 5.4830 1.5353 6.1561 1.3091 2.3823 2.1308 0.5363 0.2529 2.6627 0.8118 4.3974 4.5082 1.0072 8.2925 0.1474 2.2163 2.3157 2.7034 1.6597 1.6446 1.0753 2.6713 5.3447 1.6746 0.1825 6.0357 18.3991 14.8724 16.2747 0.4925 0.7657 1.7177 22.1372 15.2762 10.1453 109.0335 7.4174 4.0484 33.0416 11.2495 19.7179 19.0636 6.1538 4.5324 14.0985 57.8475 15.0047 1.2015 26.8003 48.0529 24.8041 29.5893 47.7974 25.3543 0.9044 7.9270 4.5859 2.2534 67.6384 3.6833 18.5465 3.0416 6.7097 0.0697 0.1915 0.3621 0.0984 2.2243 0.2404 5.1626 19.7865 4.0322 3.9340 4.4006 35.7069 3.1027 33.1311 6.2812 36.1709 8.6240 13.3490 1.7838 20.2804 13.9883 11.2139 5.1985 0.8927 1.3427 0.1505 0.5451 39.5570 12.6306 0.1878 5.5512 5.9074 2.7669 33.9022 5.0730 18.7143 1.9505 23.7095 8.3438 3.2229 6.3126 19.4020 13.2270 1.5815 19.7007 2.2646 1.7214 11.5984 17.3557 8.3598 13.3860 13.2403 5.0431 2.4002 0.5158 14.3135 4.5431 8.8824 4.0576 8.3387 16.2251 14.8985 0.8031 34.6159 38.4934 6.4938 1.4864 10.4280 0.3277 44.5373 4.8174 26.6890 27.5602 22.5177 40.4198 20.1484 22.2353 5.7072 1.9416 4.5938 32.7739 0.8634 117.7978 66.3980 19.6119 36.9877 21.7761 38.5671 29.1131 21.6166 4.8857 0.9634 12.7198 13.6758 5.0396 23.7333 3.9802 30.7961 48.2450 24.9077
temp: 298.150 k
press: 1.00000 atm
elementType: 16 8 8 8 7 6 6 6 6 6 6 6 6 6 6 6 6 6 6 6 6 6 6 6 6 6 6 6 1 1 1 1 1 1 1 1 1 1 1 1 1 1 1 1 1 1 1 1 1 1 1 1 1 1 1 1 1 1 1
symmnumber: 1
zpe: 1277638.2 jmol-1
zpe.correction: 0.486627 hartree
zpe.thermalcorrener: 0.517340 hartree
zpe.thermalcorrenthalpy: 0.518284 hartree
zpe.thermalcorrgfe: 0.421988 hartree
zpe.sumelectzpe: -1571.196925 hartree
zpe.sumelectthermal: -1571.166212 hartree
zpe.sumelectthermalent: -1571.165268 hartree
zpe.sumelectthermalfe: -1571.261565 hartree
dipole: -2.1716 3.4392 -0.0337
dipole: 4.0676
quadrupole: -154.1636 -173.9446 -178.8536
quadrupole: -2.1404 8.2480 5.5600
quadrupole: 14.8237 -4.9573 -9.8663 -2.1404 8.2480 5.5600
hfenergy: -1571.6835522 hartree
pointgroup: C01 [X(C23H31N1O3S1)]
dipole: 1.2833698 0.9504409 0.1028767 debye
polarizability: 349.6321723|-21.2743586|328.2677292|16.2765573|2.4835176|210.4054758 unknown
InChI: InChI=1S/C23H31NO3S/c1-16(2)20-11-12-22(17(3)4)23(13-20)28(25,26)24(14-21-15-27-21)18(5)19-9-7-6-8-10-19/h6-13,16-18,21H,14-15H2,1-5H3
charge 0 multiplicity 1
59 atoms
S  -0.122197 -1.098453 -0.721442
O  -1.218729 3.813188 -1.081508
O  -0.131878 -1.345393 -2.341664
O  -0.925497 -2.17966 0.212057
N  -0.657327 0.745756 -0.448169
C  -0.556478 2.713311 -1.894942
C  -1.132693 1.319742 -1.736005
C  -1.330081 3.791574 -2.588733
C  -1.535061 1.056565 0.748058
C  1.696725 -1.060453 -0.150041
C  2.41965 -2.278487 -0.171306
C  -3.04099 0.813548 0.561252
C  -0.982691 0.440443 2.050973
C  1.850553 -3.632906 -0.608216
C  2.229142 0.178537 0.237524
C  3.575716 0.254396 0.670611
C  3.764841 -2.17222 0.274384
C  4.184507 1.589263 1.104595
C  4.327297 -0.945824 0.685871
C  -3.906722 1.934376 0.467345
C  -3.598235 -0.49125 0.501051
C  1.619881 -4.542682 0.628786
C  2.755461 -4.321696 -1.661985
C  3.461007 2.166511 2.35078
C  4.188428 2.619034 -0.056455
C  -5.303323 1.761425 0.330743
C  -4.993092 -0.662571 0.358369
C  -5.851293 0.459693 0.276956
H  0.539838 2.778037 -1.879649
H  -2.238425 1.355016 -1.786563
H  -0.776589 0.672686 -2.564335
H  -2.335266 3.567316 -2.96763
H  -0.793877 4.598629 -3.101964
H  -1.396047 2.156533 0.817225
H  -1.53239 0.867957 2.907259
H  0.088839 0.677951 2.175537
H  -1.108129 -0.653902 2.074735
H  0.866172 -3.473886 -1.083228
H  1.588293 1.06445 0.193666
H  4.382451 -3.076912 0.290234
H  5.23904 1.39554 1.38671
H  5.37143 -0.917944 1.020704
H  -3.479504 2.944805 0.491091
H  -2.93937 -1.366037 0.551383
H  1.208179 -5.517668 0.309663
H  2.565393 -4.730185 1.171715
H  0.899573 -4.076533 1.322741
H  3.74733 -4.584453 -1.249279
H  2.27975 -5.25894 -2.003363
H  2.906916 -3.672817 -2.542682
H  3.481653 1.453203 3.194115
H  3.944516 3.105471 2.677432
H  2.402552 2.395679 2.124644
H  3.156562 2.867393 -0.369072
H  4.676797 3.558582 0.261413
H  4.726564 2.228267 -0.938605
H  -5.958156 2.637757 0.263133
H  -5.410743 -1.674785 0.310033
H  -6.933172 0.320219 0.169752
