program: Gaussian 09
title: 000185125
version: EM64L-G09RevD.01
frameworkgroup: C1[X(C20H21NO4)]
method: RPBEPBE
basis: SDD
operation: Freq
keyword: #p
keyword: freq=noraman
keyword: PBEPBE/SDD
title: #p freq=noraman PBEPBE/SDD
converged: NO YES NO NO
title: Mulliken charges:
elementType: O O O O N C C C C C C C C C C C C C C C C C C C C H H H H H H H H H H H H H H H H H H H H H
charge: -0.345069 -0.424526 -0.277757 -0.285801 -0.164237 -0.017977 0.256476 0.480712 -0.558023 -0.421382 0.257256 0.153900 0.602421 -0.767552 -0.109371 -0.642362 0.167485 -0.648092 -0.527002 -0.665169 0.201269 0.180714 -0.534815 -0.536619 -0.522243 0.222473 0.236427 0.220609 0.214072 0.250687 0.259891 0.221393 0.220495 0.240387 0.317086 0.266238 0.374494 0.258101 0.235517 0.227490 0.226797 0.239609 0.220974 0.209727 0.226499 0.258799
chargesum: 0.00000
title: Mulliken charges with hydrogens summed into heavy atoms:
elementType: O O O O N C C C C C C C C C C C C C C C C C C C C
charge: -0.345069 -0.050032 -0.277757 -0.285801 -0.164237 -0.017977 0.256476 0.480712 -0.099122 0.013298 0.257256 0.153900 0.602421 -0.516865 -0.109371 -0.382471 0.167485 0.034182 -0.209916 -0.398931 0.201269 0.180714 0.186293 0.150762 0.172781
polarizability: 3.94811260e+02 -1.49977713e+00 2.91979752e+02 5.23399099e+00 -5.67234812e+00 1.27884239e+02
1716.lowfreq: -4.0998 -0.0007 0.0002 0.0003 5.5213 7.0180 39.0099 44.7718 58.1867
frequency: 39.0080 44.7111 58.1623 75.7450 90.6227 98.1939 112.7119 125.0977 140.0880 152.9073 159.8397 167.1653 187.0991 192.7641 207.0247 215.6753 248.1058 253.6976 261.2888 274.5164 288.8386 304.6392 323.3141 335.4086 346.0703 369.7475 383.7205 409.0463 434.0577 455.6836 463.3925 475.5705 501.0495 510.6008 531.1573 576.3535 586.5701 609.4793 613.8764 621.7854 645.4945 693.6040 702.2552 714.0499 720.4870 746.6454 750.4247 780.9604 800.3699 833.8624 847.0934 864.4853 877.2720 910.7630 917.2967 920.9555 946.7623 976.1867 989.8458 994.0553 1055.5357 1078.2756 1087.8082 1098.2311 1110.6727 1111.0698 1112.4832 1115.7774 1125.6892 1145.6011 1152.2268 1162.0175 1164.3108 1183.6550 1189.6981 1210.1152 1223.3397 1231.1907 1257.8366 1260.1555 1284.3033 1296.8410 1332.0994 1334.1244 1363.6586 1378.0515 1401.1039 1410.6459 1411.7912 1420.8060 1426.1906 1434.5296 1440.7828 1446.9433 1452.2220 1454.0113 1456.3421 1460.0380 1462.7794 1467.9527 1472.8763 1474.1900 1481.6303 1483.0064 1499.0689 1506.0980 1534.2306 1578.7020 1604.5690 1616.7678 1627.5294 2909.0440 2920.3967 2957.9029 2972.4445 2973.2606 2977.7339 3022.5466 3042.6579 3044.5728 3049.0463 3073.1407 3081.0340 3087.4895 3112.7149 3120.7346 3124.6068 3147.2897 3156.7377 3158.3593 3180.1418 3444.9364
redmass: 3.8475 3.4369 2.8391 3.0059 3.4214 3.2065 3.9430 2.3748 3.3998 2.5317 1.1107 1.9559 3.0755 3.6106 1.6255 2.0719 4.2409 1.7684 2.8102 2.4264 4.1757 4.2611 4.6049 5.2370 4.5172 4.1770 4.8519 4.6118 6.7250 4.5082 4.4277 3.5753 3.8153 3.9820 6.0305 4.2721 3.8838 2.7540 1.6185 4.0079 4.9192 3.9220 7.1712 3.9300 5.6828 3.8809 4.8563 5.8911 2.8104 1.8692 3.7518 1.9096 2.0031 1.9573 1.3920 5.4823 6.6794 2.8674 4.5430 3.4307 2.2494 3.1002 2.3397 3.8428 1.2490 1.3118 1.2622 1.2494 2.5758 1.4061 1.4353 1.5880 1.4738 1.9437 1.3214 1.9674 1.7923 1.6741 2.2185 2.8483 1.8433 2.4441 2.2582 1.8022 1.8974 5.3679 4.4305 2.0602 3.0959 4.3213 1.3595 1.2340 1.3040 1.2447 1.4102 1.3661 1.0551 1.8135 1.0663 1.0507 1.0851 1.0902 1.0555 1.1506 1.2813 2.5525 6.0123 6.3778 7.8371 6.9683 6.9527 1.0667 1.0529 1.0328 1.0347 1.0296 1.0629 1.0848 1.0912 1.1035 1.0985 1.1048 1.0968 1.0980 1.1035 1.0997 1.1046 1.0915 1.0925 1.0899 1.0896 1.0632
irintensity: 1.7697 3.0214 4.0353 1.4876 2.2619 1.5147 4.0116 2.7659 3.1506 1.6047 0.2670 2.5995 15.5091 1.7050 1.9553 1.8811 3.2728 0.3664 6.7209 2.1993 5.6637 3.7517 12.1362 18.6518 1.2548 2.8816 0.8548 1.8522 7.6482 1.3834 1.2221 1.0644 5.8198 4.0135 2.6134 4.1377 18.7658 58.7959 75.1583 17.8807 3.8916 0.4543 2.4217 2.0039 28.8304 3.9898 2.3385 20.9700 5.7088 5.4619 14.6424 13.3487 10.3280 28.4852 53.4676 43.8017 49.3415 26.3580 54.6676 9.9471 8.2507 55.8568 17.5211 79.4874 19.9169 23.7304 0.6138 0.2473 50.7250 15.7114 19.3609 29.3204 147.3196 21.9328 45.0013 131.7452 12.5723 63.7543 104.6174 48.6115 35.1129 38.7014 153.2798 62.5259 18.9605 15.8076 30.1907 64.1924 88.4244 4.9057 0.8113 15.6895 20.0008 36.6254 58.1328 3.0375 13.2725 17.0656 13.6636 11.8026 15.7634 77.0871 29.1349 22.7038 115.3918 117.2044 50.3512 26.6763 130.3224 71.3598 157.8547 65.2076 159.6860 59.1322 125.1991 42.5038 24.5077 38.8953 59.7776 48.0651 34.2929 21.7541 42.8690 28.5948 24.6235 28.9270 21.1647 5.0988 5.8466 18.8969 12.7602 51.1271
temp: 298.150 k
press: 1.00000 atm
elementType: 8 8 8 8 7 6 6 6 6 6 6 6 6 6 6 6 6 6 6 6 6 6 6 6 6 1 1 1 1 1 1 1 1 1 1 1 1 1 1 1 1 1 1 1 1 1
symmnumber: 1
zpe: 966128.2 jmol-1
zpe.correction: 0.367979 hartree
zpe.thermalcorrener: 0.391205 hartree
zpe.thermalcorrenthalpy: 0.392149 hartree
zpe.thermalcorrgfe: 0.316674 hartree
zpe.sumelectzpe: -1128.532885 hartree
zpe.sumelectthermal: -1128.509658 hartree
zpe.sumelectthermalent: -1128.508714 hartree
zpe.sumelectthermalfe: -1128.584190 hartree
dipole: -1.0399 0.1717 0.3938
dipole: 1.1251
quadrupole: -129.5735 -132.0411 -148.3985
quadrupole: 23.0292 -8.4968 6.7242
quadrupole: 7.0975 4.6300 -11.7275 23.0292 -8.4968 6.7242
hfenergy: -1128.9008636 hartree
pointgroup: C01 [X(C20H21N1O4)]
dipole: 0.4094559 0.0555868 -0.1587353 debye
polarizability: 394.888742|-0.8291735|292.0937055|3.4401351|3.1445589|127.6928035 unknown
InChI: InChI=1S/C20H21NO4/c1-21-6-5-11-8-15(22)20(25-4)19-13-10-17(24-3)16(23-2)9-12(13)7-14(21)18(11)19/h7-10,22H,5-6H2,1-4H3
charge 0 multiplicity 1
46 atoms
O  -0.100633 2.967554 -0.241545
O  2.36892 3.881407 0.229421
O  -4.366639 0.80244 0.0790
O  -4.466484 -2.014843 -0.336358
N  2.825747 -2.571596 -0.077001
C  1.826282 -0.307539 0.035183
C  1.676167 -1.760242 -0.103571
C  3.127124 0.258252 0.257192
C  4.311587 -0.675661 0.437004
C  4.127623 -1.952056 -0.397117
C  0.657961 0.548428 -0.038794
C  -0.677459 -0.049711 -0.090731
C  -0.778084 -1.480507 -0.218803
C  0.398352 -2.301915 -0.262447
C  0.903282 1.959511 -0.031753
C  3.303617 1.643426 0.353811
C  2.188208 2.494657 0.191413
C  2.689531 -4.014161 -0.295103
C  -1.886374 0.706783 0.033677
C  -2.074827 -2.078612 -0.276511
C  -3.147879 0.098285 -0.011966
C  -3.24847 -1.328033 -0.182616
C  -0.447712 3.135551 -1.677978
C  -4.288936 2.256637 0.222261
C  -5.498539 -1.824283 0.70482
H  5.251496 -0.168853 0.152533
H  4.398013 -0.961636 1.504561
H  4.199989 -1.706942 -1.4821
H  4.925671 -2.679138 -0.163019
H  0.258384 -3.376623 -0.405129
H  4.288915 2.084135 0.533545
H  3.671823 -4.495406 -0.154712
H  2.318955 -4.267298 -1.31398
H  1.989018 -4.452064 0.439671
H  -1.801112 1.78181 0.199923
H  -2.173755 -3.163611 -0.385788
H  1.458966 4.288879 0.179687
H  -0.950313 2.228599 -2.059168
H  0.462418 3.337656 -2.272894
H  -1.132997 3.996893 -1.722785
H  -3.765076 2.54392 1.154512
H  -5.333882 2.599089 0.259352
H  -3.774291 2.717288 -0.6439
H  -5.111476 -2.144164 1.692069
H  -6.330156 -2.478307 0.400579
H  -5.825255 -0.772993 0.750357
