program: Gaussian 09
title: 000015824
version: EM64L-G09RevD.01
frameworkgroup: C1[X(C5H10N2O5)]
method: RPBEPBE
basis: SDD
operation: Freq
keyword: #p
keyword: freq=noraman
keyword: PBEPBE/SDD
title: #p freq=noraman PBEPBE/SDD
converged: YES YES NO NO
title: Mulliken charges:
elementType: O O O O O N N C C C C C H H H H H H H H H H
charge: -0.418644 -0.420439 -0.260119 -0.461221 -0.447802 -0.161188 -0.188804 -0.111263 -0.099919 0.296726 -0.303931 -0.305114 0.258415 0.290698 0.244217 0.231712 0.242010 0.218858 0.348443 0.345777 0.350579 0.351010
chargesum: 0.00000
title: Mulliken charges with hydrogens summed into heavy atoms:
elementType: O O O O O N N C C C C C
charge: -0.070201 -0.074662 -0.260119 -0.110643 -0.096792 -0.161188 -0.188804 0.147151 0.190779 0.296726 0.171998 0.155755
polarizability: 1.02835341e+02 -1.58183933e-01 8.80644729e+01 2.47631708e-01 -1.11915937e+00 6.79228558e+01
1716.lowfreq: -7.9153 -0.0006 0.0007 0.0008 2.1279 10.9685 46.1344 57.6100 64.6073
frequency: 46.0413 57.6052 64.5797 85.6973 113.1437 135.3416 162.8738 182.6636 239.4976 248.4786 264.1912 295.6072 313.3813 345.6961 385.0510 435.9557 517.9610 552.5603 596.0187 638.7703 678.0588 728.1952 765.9146 909.6627 920.2156 935.3379 955.8382 981.1672 991.4018 1042.1147 1047.8431 1131.6350 1144.3084 1156.1300 1174.5674 1213.4863 1222.0029 1230.2376 1258.2962 1306.2451 1330.3346 1360.5847 1367.2689 1375.8840 1405.4126 1414.9983 1425.1469 1466.3939 1469.5190 1690.5102 2975.2118 2986.2615 3000.6171 3041.0087 3052.0154 3100.0103 3531.8201 3556.7219 3564.0395 3564.2635
redmass: 4.8381 4.4434 2.8960 3.1450 6.8185 4.8815 1.5402 1.2898 3.2481 2.6626 1.1266 4.0338 3.9349 6.0119 1.2468 6.9493 7.3313 6.7258 3.5452 4.6793 5.0937 7.5733 4.3957 4.7792 6.1432 5.0347 3.6786 3.1293 3.3714 2.3147 2.3760 1.4307 1.4321 1.3451 1.4785 1.2660 1.2238 1.3607 1.5253 2.0599 2.0311 1.2902 1.2053 3.0703 1.8273 1.3635 1.7042 1.0818 1.0822 10.5848 1.0569 1.0560 1.0862 1.1075 1.1091 1.0875 1.0657 1.0661 1.0660 1.0661
irintensity: 0.3207 9.1717 12.9360 12.6638 1.2266 4.2973 138.3341 146.7902 4.5590 8.9592 117.7346 5.1598 22.8216 36.5347 155.7925 1.3262 17.7178 15.1870 25.6115 7.5783 17.1782 37.7160 39.6285 49.7459 23.5276 245.7675 72.3076 123.7059 101.7611 8.3571 42.3693 30.7632 103.6075 32.8646 111.6752 76.1710 51.8952 11.8739 69.4898 44.2050 23.5342 59.9532 36.2792 30.8250 290.4202 21.0353 102.8581 18.7122 22.9634 376.2688 63.6888 52.5186 23.7790 11.8653 11.2518 7.7671 8.8953 6.9815 4.6769 3.2115
temp: 298.150 k
press: 1.00000 atm
elementType: 8 8 8 8 8 7 7 6 6 6 6 6 1 1 1 1 1 1 1 1 1 1
symmnumber: 1
zpe: 437544.9 jmol-1
zpe.correction: 0.166652 hartree
zpe.thermalcorrener: 0.180123 hartree
zpe.thermalcorrenthalpy: 0.181067 hartree
zpe.thermalcorrgfe: 0.125956 hartree
zpe.sumelectzpe: -681.176151 hartree
zpe.sumelectthermal: -681.162681 hartree
zpe.sumelectthermalent: -681.161737 hartree
zpe.sumelectthermalfe: -681.216848 hartree
dipole: -0.8226 1.9810 0.9355
dipole: 2.3401
quadrupole: -47.0248 -74.5275 -74.3091
quadrupole: -3.8158 3.7602 -3.1735
quadrupole: 18.2623 -9.2403 -9.0220 -3.8158 3.7602 -3.1735
hfenergy: -681.3428033 hartree
pointgroup: C01 [X(C5H10N2O5)]
dipole: -0.3264968 0.7748617 0.374978 debye
dipolederiv: -0.5759613 0.0422744 -0.0362185 0.0436214 -0.3616126 0.2669971 -0.1048088 0.4748193 -0.7277404 -0.4138457 0.1821363 -0.1259122 0.1349675 -0.552026 -0.2138201 -0.1770621 -0.3673453 -0.7428769 -0.6029453 -0.0076948 -0.0631893 0.0077627 -1.2692532 -0.0349019 -0.0842802 -0.0021669 -0.3627032 -0.595217 0.1021483 0.2284133 0.1671526 -0.4920282 0.0513149 0.4801793 0.1008815 -0.6186543 -0.5594289 -0.1114591 0.22289 -0.1750589 -0.4811201 -0.0412049 0.4733412 -0.0919113 -0.6482135 -1.3737818 0.1381394 -0.0749793 0.2539822 -0.9222546 0.2277705 -0.2575478 0.0606884 -0.4195741 -1.382279 -0.0940922 -0.0757417 -0.1892356 -0.9190045 -0.2934576 -0.2822233 -0.0969782 -0.5070147 0.2580573 0.0501463 -0.0723678 -0.0465208 0.9623487 -0.3530619 0.0108233 -0.4175269 0.7059464 0.196013 -0.1155762 -0.0715622 -0.0510102 0.8852798 0.3228674 0.0055889 0.364824 0.7682168 1.8159247 -0.0376156 0.4086499 -0.0273296 1.765753 0.02353 0.4475252 0.0141002 0.3561011 1.2951745 0.0674343 -0.2174668 0.1395953 0.2928603 0.0032996 -0.2829283 -0.0268439 0.6774355 1.2697225 -0.0649162 -0.2412315 -0.1407314 0.3010813 -0.0104808 -0.3035593 0.0129212 0.7169906 0.0149123 0.0781326 0.0485163 0.0633337 -0.064358 -0.0180973 0.038607 -0.007803 -0.0884109 0.053993 -0.0617022 0.0385979 -0.0381723 -0.0123091 0.0160563 0.0133652 0.0113545 -0.0053394 0.0697516 0.0247609 0.0481385 -0.0433791 -0.0739115 -0.0785212 0.0664367 -0.0191872 0.0298935 -0.0775998 0.0317057 -0.0366917 0.0962717 0.064469 0.0920133 -0.0148961 0.0375234 -0.1225052 0.067959 -0.0265748 0.0466681 0.0444735 -0.0841488 0.0785845 0.0673627 0.0222562 0.0222742 -0.0834638 -0.0244749 -0.0433734 -0.0992315 0.0625339 -0.0877833 -0.0260175 -0.0351091 -0.1451385 0.3743357 -0.0401376 0.010026 -0.0082988 0.0215723 -0.0539883 0.0046143 -0.1045729 0.2750526 0.2241173 -0.1405469 0.1044077 -0.1399741 0.2152364 0.1068729 0.0884685 0.0758954 0.2626121 0.0134041 -0.0997105 -0.0572258 -0.1166929 0.3320768 -0.0610353 -0.0906648 -0.0700367 0.2813858 0.0111576 0.1076228 -0.0403474 0.1244748 0.3288152 0.0570462 -0.072324 0.0642173 0.2922624 unknown
polarizability: 102.7935925|-0.2813851|88.1054393|1.1673484|-0.7264148|67.9236377 unknown
InChI: InChI=1S/C5H10N2O5/c8-1-6-3(10)4(11)7(2-9)5(6)12/h3-4,8-11H,1-2H2
charge 0 multiplicity 1
22 atoms
O  -0.801592 1.693935 -1.619124
O  0.877421 1.806422 1.613869
O  -0.002536 -2.348733 -0.026193
O  -3.171876 -0.367481 0.766468
O  3.12882 -0.394163 -0.841189
N  -1.072184 -0.233812 -0.279062
N  1.096779 -0.262952 0.34119
C  -0.710559 1.166769 -0.250138
C  0.756571 1.156762 0.308527
C  0.008383 -1.094712 -0.000207
C  -2.416387 -0.696763 -0.466651
C  2.448538 -0.744424 0.42418
H  -1.37131 1.747368 0.42445
H  1.438976 1.72507 -0.340877
H  -2.368008 -1.789502 -0.632805
H  -2.866146 -0.183433 -1.338734
H  2.397632 -1.840684 0.569058
H  2.96047 -0.257673 1.278658
H  -0.818282 2.684794 -1.584973
H  0.339768 1.300208 2.278165
H  -4.11945 -0.634757 0.651368
H  4.080471 -0.666937 -0.789982
