program: Gaussian 09
title: 000187516
version: EM64L-G09RevD.01
frameworkgroup: C1[X(C18H16O4)]
method: RPBEPBE
basis: SDD
operation: Freq
keyword: #pfreq=noraman
keyword: PBEPBE/SDD
title: #p freq=noraman PBEPBE/SDD
converged: NO YES NO NO
title: Mulliken charges:
elementType: O O O O C C C C C C C C C C C C C C C C C C H H H H H H H H H H H H H H H H
charge: -0.456051 -0.474402 -0.492672 -0.445372 -0.106990 -0.362442 -0.222648 -0.330232 0.315967 0.393421 0.193992 0.480052 -0.476758 -0.491580 -0.633140 -0.710223 0.418278 0.398482 -0.436841 -0.420310 -0.243740 -0.242705 0.224315 0.254791 0.250570 0.234901 0.235216 0.243637 0.227491 0.247223 0.387315 0.357487 0.367638 0.372585 0.242948 0.241879 0.228935 0.228984
chargesum: 0.00000
title: Mulliken charges with hydrogens summed into heavy atoms:
elementType: O O O O C C C C C C C C C C C C C C C C C C
charge: -0.068736 -0.116915 -0.125033 -0.072786 0.117325 -0.107651 0.027922 -0.095331 0.315967 0.393421 0.193992 0.480052 -0.241543 -0.247943 -0.405649 -0.463001 0.418278 0.398482 -0.193893 -0.178431 -0.014805 -0.013721
polarizability: 3.50496629e+02 3.10502051e+01 2.15157551e+02 1.23974430e+01 -1.29788967e+01 1.15391600e+02
1716.lowfreq: -6.6162 -0.0011 -0.0008 -0.0006 0.7486 8.2768 38.2143 47.6558 61.5276
frequency: 38.1883 47.5929 61.5031 100.5432 124.5273 130.8202 148.4906 197.0470 210.2841 228.8784 242.5130 260.1516 288.5649 309.5594 331.7517 347.6220 351.8540 387.1778 402.1968 421.8256 436.6307 469.2103 479.2138 484.2923 509.8559 516.9821 550.6577 569.1093 591.9519 618.3983 630.1795 650.1145 670.4591 703.6743 717.1986 736.7595 753.8037 772.8725 777.7869 803.9393 809.8369 823.6960 849.6767 857.1991 889.1963 895.0535 908.8761 931.9319 946.0675 961.0793 966.0434 971.1305 977.4831 990.3253 1006.3143 1014.0949 1019.2613 1076.6719 1088.4652 1129.8592 1156.6523 1164.0614 1171.5952 1187.8607 1193.5419 1201.4573 1218.9235 1229.4039 1254.0541 1266.0880 1276.1452 1281.0580 1292.5576 1297.4692 1312.0829 1328.3240 1351.1510 1378.4212 1389.3668 1402.1933 1407.0300 1420.8760 1436.7506 1443.4241 1453.2759 1460.0716 1487.8333 1555.7845 1566.8741 1586.9462 1628.2913 1637.9733 2987.9475 3019.9606 3032.3258 3055.1660 3117.3630 3120.2166 3121.6030 3125.1922 3138.4616 3143.4277 3145.7446 3162.3851 3251.5655 3404.1317 3549.3102 3621.1874
redmass: 5.9389 5.7754 5.2178 5.5303 5.3249 4.9486 1.1609 7.0766 5.0846 6.6214 4.9098 4.7795 4.2304 4.9827 1.1730 4.7992 5.6612 4.0631 5.5831 4.3485 4.3595 2.4493 4.5111 4.3550 4.2644 1.3606 3.7038 4.9121 4.7208 6.5180 5.0114 5.3338 3.9814 1.4994 2.8600 3.5642 1.3054 4.6585 2.7299 3.0216 2.7652 1.5587 3.7096 1.5991 2.4193 3.7574 2.9404 2.1850 4.1561 4.0012 1.4652 2.9829 1.8960 1.3521 3.9906 2.3027 3.8696 2.2132 2.2916 1.7029 1.2436 1.2850 1.0891 1.5725 1.3202 1.3846 1.6690 1.5162 1.2368 1.3390 1.4722 1.9718 1.2987 2.0447 1.7093 1.7649 1.5166 1.5994 1.3343 4.4047 1.8604 2.2021 5.9460 4.5796 1.1727 2.7686 3.1533 5.7251 8.2322 5.6435 6.8754 6.6896 1.0855 1.0864 1.0874 1.0863 1.0908 1.0859 1.0866 1.0887 1.0900 1.0951 1.0979 1.1003 1.0678 1.0643 1.0661 1.0672
irintensity: 1.2674 2.1693 4.1031 0.5867 5.0527 5.3105 118.2186 12.2804 9.7725 10.5580 2.1356 0.9743 14.3092 5.0172 81.2558 2.3150 8.7970 10.1323 1.2445 2.2178 10.2454 22.0199 0.0813 2.8728 12.2976 123.0686 0.5556 9.8021 12.9252 3.4574 20.5544 6.7293 9.0764 160.4313 22.8158 13.5112 62.1707 11.8831 3.1608 28.0868 15.0470 2.9736 5.4185 3.4140 17.4001 11.2457 80.4953 1.2999 3.4836 34.2176 22.4914 48.0388 65.6760 0.2221 42.4170 4.4814 44.9888 8.2416 27.0569 4.9545 40.2795 0.5526 0.8655 3.7097 12.0706 19.4614 9.4542 10.1425 18.0013 10.5571 17.1548 1.9289 1.7020 4.6682 0.9906 11.2298 10.5361 2.5695 66.0178 9.7172 17.9046 0.1920 0.6738 3.0468 125.1674 5.4946 3.4734 12.6582 3.2846 0.0352 5.0499 1.1821 28.9767 58.0868 75.1159 10.2114 6.0226 4.4844 4.5661 0.9645 6.1872 33.0915 31.9160 44.5117 125.9537 78.6392 5.9402 23.5044
temp: 298.150 k
press: 1.00000 atm
elementType: 8 8 8 8 6 6 6 6 6 6 6 6 6 6 6 6 6 6 6 6 6 6 1 1 1 1 1 1 1 1 1 1 1 1 1 1 1 1
symmnumber: 1
zpe: 781280.9 jmol-1
zpe.correction: 0.297574 hartree
zpe.thermalcorrener: 0.315541 hartree
zpe.thermalcorrenthalpy: 0.316485 hartree
zpe.thermalcorrgfe: 0.252312 hartree
zpe.sumelectzpe: -994.848142 hartree
zpe.sumelectthermal: -994.830175 hartree
zpe.sumelectthermalent: -994.829231 hartree
zpe.sumelectthermalfe: -994.893404 hartree
dipole: -0.1072 0.2118 -1.2163
dipole: 1.2392
quadrupole: -109.7535 -115.1010 -135.3170
quadrupole: 0.2809 -8.0698 -14.4736
quadrupole: 10.3037 4.9562 -15.2598 0.2809 -8.0698 -14.4736
hfenergy: -995.1457164 hartree
pointgroup: C01 [X(C18H16O4)]
dipole: 0.0154814 -0.0530138 -0.4844165 debye
polarizability: 350.2231547|29.5212781|211.6357848|-22.1621294|18.0500547|119.1868402 unknown
InChI: InChI=1S/C18H16O4/c19-15-12-6-5-11-7-9-3-1-2-4-10(9)8-13(11)14(12)16(20)18(22)17(15)21/h1-8,15-22H
charge 0 multiplicity 1
38 atoms
O  -2.698064 2.470404 -1.241642
O  -1.869135 1.347033 2.191177
O  -3.702571 0.213962 -1.786495
O  -3.771614 -0.597454 1.893536
C  -2.987377 1.72231 -0.024631
C  -1.642956 1.397034 0.69915
C  -3.866696 0.459888 -0.333628
C  -3.411507 -0.780044 0.475539
C  -1.045453 0.055896 0.334771
C  -1.928736 -1.029139 0.25617
C  0.375955 -0.138131 0.131925
C  0.855511 -1.485264 -0.179566
C  -1.443535 -2.345895 -0.037673
C  -0.090484 -2.568123 -0.252456
C  1.330176 0.90683 0.221722
C  2.237243 -1.707104 -0.396631
C  2.71316 0.684992 0.007115
C  3.183052 -0.658252 -0.314415
C  3.679007 1.751251 0.097164
C  4.591805 -0.870173 -0.532721
C  5.031998 1.510074 -0.119483
C  5.493965 0.184581 -0.438451
H  -3.564299 2.397739 0.636998
H  -0.967803 2.238246 0.469943
H  -4.927493 0.669238 -0.097574
H  -4.000178 -1.660337 0.159966
H  -2.159054 -3.174576 -0.086631
H  0.279882 -3.57441 -0.480652
H  1.00787 1.924538 0.46587
H  2.580733 -2.722357 -0.632576
H  -2.886313 1.843987 -1.998746
H  -2.053217 2.263264 2.522876
H  -4.452701 -0.327068 -2.129918
H  -3.114575 0.058432 2.287125
H  3.327688 2.761511 0.338817
H  4.941624 -1.880931 -0.774633
H  5.756207 2.328985 -0.049079
H  6.562985 0.013564 -0.60606
