program: Gaussian 09
title: 000185087
version: EM64L-G09RevD.01
frameworkgroup: C1[X(C7H14F3OPS2)]
method: RPBEPBE
basis: SDD
operation: Freq
keyword: #p
keyword: freq=noraman
keyword: PBEPBE/SDD
title: #p freq=noraman PBEPBE/SDD
converged: YES YES NO NO
title: Mulliken charges:
elementType: S S P F F F O C C C C C C C H H H H H H H H H H H H H H
charge: -0.006811 -0.213860 0.446983 -0.146205 -0.172094 -0.172411 -0.423773 -0.333687 -0.346449 -0.637405 -0.669550 -0.879579 -0.338991 0.445399 0.292411 0.216690 0.210149 0.210385 0.261369 0.225947 0.227771 0.216715 0.214654 0.278307 0.281884 0.300749 0.277171 0.234232
chargesum: 0.00000
title: Mulliken charges with hydrogens summed into heavy atoms:
elementType: S S P F F F O C C C C C C C
charge: -0.006811 -0.213860 0.446983 -0.146205 -0.172094 -0.172411 -0.423773 -0.041276 0.080390 0.060295 -0.010410 -0.018639 0.172412 0.445399
polarizability: 1.65583851e+02 -9.63942902e+00 1.51391069e+02 -8.82793821e+00 -5.55166802e+00 1.23299260e+02
1716.lowfreq: -0.0018 -0.0012 0.0008 6.7704 12.9565 15.2012 24.4650 35.4246 44.4977
frequency: 23.4444 35.3419 44.3827 47.5354 71.2667 97.0462 104.5161 123.4746 154.1272 175.2775 179.9245 198.8193 205.0794 218.7537 225.2599 234.0135 249.8261 270.5676 324.5142 330.5649 355.5794 392.7603 402.2048 442.7961 459.4333 463.6052 519.9532 552.7575 567.9657 599.6725 707.3808 746.0892 785.9694 838.6836 889.8811 945.7482 961.7424 968.7717 1000.3214 1006.6292 1015.0185 1036.3394 1081.3895 1091.5835 1114.1618 1160.8907 1203.0300 1235.7859 1265.9939 1283.4078 1290.9601 1336.1387 1342.8704 1362.7727 1391.9083 1398.2551 1427.2281 1439.5866 1446.2154 1457.9993 1468.9958 1473.3483 1475.4378 1483.9854 2971.5128 2979.0955 2983.1655 3001.1842 3004.8435 3015.4060 3027.7610 3074.6223 3079.2715 3086.0815 3086.5604 3097.0652 3137.8699 3142.5850
redmass: 6.7286 3.3637 6.1664 9.8083 9.5085 5.7295 1.9599 6.9950 4.9810 3.7793 3.7606 3.2788 3.7676 1.1896 1.2242 1.4377 3.5555 5.5531 3.4998 2.9776 3.7011 6.3034 5.9127 3.0230 7.5697 10.2431 9.0059 3.9513 7.3839 9.4928 7.9110 8.0450 1.1922 2.0688 2.8424 1.2937 1.2868 1.3153 1.4992 6.4890 8.2422 2.8214 1.4248 2.4679 2.5144 2.0895 7.8193 1.2302 1.2345 1.1762 1.2571 1.1626 1.5182 1.2476 1.2065 1.1969 1.0619 1.0540 1.0542 1.0647 1.0555 1.0458 1.0392 1.0537 1.0588 1.0381 1.0368 1.0873 1.0613 1.0311 1.0989 1.0975 1.0998 1.1000 1.1011 1.1009 1.1018 1.1026
irintensity: 0.7073 0.2070 1.0958 1.6025 2.7113 3.6788 0.3437 2.0301 0.9552 1.6915 0.1721 1.5426 0.5236 0.0947 0.5024 1.3014 8.9411 2.5464 1.9407 0.7632 22.7015 8.8725 33.9421 1.6713 11.0389 7.7675 82.9223 13.7070 18.8701 65.1979 27.0744 17.4481 16.8951 5.1681 83.8593 51.9621 12.8042 48.8790 87.9388 260.2829 181.6882 0.4050 7.5019 87.5339 1.7658 5.4704 98.3639 4.4971 35.2627 27.9591 0.6840 11.9007 5.2174 9.7037 15.1749 22.8638 18.1486 13.8043 3.4761 4.8288 15.9637 0.5776 26.0540 10.8199 20.7484 40.2535 25.5040 2.5398 30.7343 2.0710 9.2144 18.9365 39.9243 44.9693 2.2936 14.0144 1.1903 0.3606
temp: 298.150 k
press: 1.00000 atm
elementType: 16 16 15 9 9 9 8 6 6 6 6 6 6 6 1 1 1 1 1 1 1 1 1 1 1 1 1 1
symmnumber: 1
zpe: 543654.9 jmol-1
zpe.correction: 0.207067 hartree
zpe.thermalcorrener: 0.225947 hartree
zpe.thermalcorrenthalpy: 0.226891 hartree
zpe.thermalcorrgfe: 0.158099 hartree
zpe.sumelectzpe: -1786.108354 hartree
zpe.sumelectthermal: -1786.089474 hartree
zpe.sumelectthermalent: -1786.088530 hartree
zpe.sumelectthermalfe: -1786.157322 hartree
dipole: -0.5247 0.5165 1.5078
dipole: 1.6780
quadrupole: -100.3964 -112.1637 -106.4881
quadrupole: -14.9579 -0.6026 8.1008
quadrupole: 5.9530 -5.8143 -0.1387 -14.9579 -0.6026 8.1008
hfenergy: -1786.3154208 hartree
pointgroup: C01 [X(C7H14F3O1P1S2)]
dipole: -0.0663655 -0.2905684 -0.5890651 debye
polarizability: 159.6250543|12.9543184|149.706149|15.6393038|-6.3388754|130.9429765 unknown
InChI: InChI=1S/C7H14F3OPS2/c1-4-6(2)14-12(3,13)11-5-7(8,9)10/h6H,4-5H2,1-3H3
charge 0 multiplicity 1
28 atoms
S  1.515487 0.345159 -0.942866
S  1.297353 -2.664286 1.185907
P  0.369192 -1.485539 -0.232831
F  -2.177976 1.77504 -0.225373
F  -3.796114 0.830091 -1.51109
F  -1.616904 0.689295 -2.13846
O  -1.164374 -0.865835 0.487424
C  2.435246 0.744016 0.711457
C  3.639853 1.646623 0.364655
C  1.456506 1.382093 1.70857
C  4.725483 0.97665 -0.502824
C  -0.106908 -2.318741 -1.836845
C  -2.397427 -0.6757 -0.250974
C  -2.477408 0.654921 -1.010448
H  2.781457 -0.242836 1.075672
H  3.278324 2.576526 -0.117284
H  4.080604 1.954797 1.335234
H  1.984485 1.591035 2.659287
H  0.607493 0.712533 1.928142
H  1.053489 2.332427 1.315692
H  4.329801 0.695809 -1.494767
H  5.579654 1.660785 -0.655537
H  5.106343 0.057535 -0.020236
H  -0.788015 -3.157662 -1.621139
H  -0.570444 -1.594783 -2.524953
H  0.817662 -2.712417 -2.286609
H  -3.192309 -0.672101 0.514014
H  -2.607255 -1.483533 -0.978619
