program: Gaussian 09
title: 000185085
version: EM64L-G09RevD.01
frameworkgroup: C1[X(C7H14F3OPS2)]
method: RPBEPBE
basis: SDD
operation: Freq
keyword: #p
keyword: freq=noraman
keyword: PBEPBE/SDD
title: #p freq=noraman PBEPBE/SDD
converged: NO YES NO NO
title: Mulliken charges:
elementType: S S P F F F O C C C C C C C H H H H H H H H H H H H H H
charge: 0.036575 -0.216582 0.423051 -0.173711 -0.171905 -0.142091 -0.418943 -0.635558 -0.657039 -0.288937 -0.617575 -0.346965 -0.671073 0.445240 0.294697 0.274478 0.272209 0.287191 0.211283 0.222787 0.235702 0.220937 0.256105 0.230562 0.277395 0.208463 0.221756 0.221949
chargesum: 0.00000
title: Mulliken charges with hydrogens summed into heavy atoms:
elementType: S S P F F F O C C C C C C C
charge: 0.036575 -0.216582 0.423051 -0.173711 -0.171905 -0.142091 -0.418943 -0.066383 -0.097639 0.145133 0.095169 0.160992 -0.018906 0.445240
polarizability: 1.78686183e+02 1.11092526e+01 1.49254228e+02 9.87440103e+00 -8.72175661e+00 1.15779080e+02
1716.lowfreq: -10.1564 -5.5577 -0.0026 -0.0024 0.0014 10.0952 14.0750 35.8250 42.2968
frequency: 13.0389 35.6815 42.2003 45.2561 66.0965 84.4156 97.2087 105.0038 119.0519 154.9179 162.2295 172.8623 195.8419 215.7930 222.1900 225.9599 229.6493 276.5780 299.4238 324.8593 356.5522 389.8009 437.5915 459.5305 463.6070 517.7258 564.9671 601.1671 662.9528 666.9896 723.7721 747.5495 775.1796 843.8799 891.5372 897.4075 991.3663 1003.7660 1014.6566 1039.2461 1041.3180 1048.5583 1070.2785 1090.9820 1107.7673 1204.9324 1221.8392 1240.9497 1258.5653 1265.6823 1278.9517 1290.6370 1327.4515 1358.1356 1389.4967 1401.2700 1426.0199 1427.6553 1442.9498 1464.3673 1468.4969 1476.3370 1482.9710 1483.6420 2978.5622 2991.9562 2992.9710 3000.7133 3005.8864 3025.7066 3045.4379 3073.9500 3079.8698 3081.6464 3086.9241 3089.5397 3090.5767 3103.8097
redmass: 5.3772 8.0778 4.9514 5.6494 8.8390 1.7291 3.0501 4.4754 5.3898 1.9875 3.9795 3.5309 3.6867 1.5204 5.4697 3.5130 1.8603 3.2059 6.5260 3.2990 4.8210 7.8936 5.0930 8.3711 10.5582 10.7768 8.8811 8.8576 5.0493 5.7153 1.1031 7.7967 1.2280 1.2099 2.8920 1.8788 1.8352 8.0562 8.0696 2.6042 1.3809 2.1272 1.2980 2.4491 2.1806 7.4592 1.3407 1.1939 1.1895 1.2474 1.2966 1.0979 1.4085 1.2576 1.2026 1.1792 1.0799 1.0858 1.0750 1.0382 1.0655 1.0422 1.0658 1.0487 1.0354 1.0363 1.0611 1.0596 1.0608 1.0595 1.1010 1.1013 1.1010 1.0996 1.1012 1.1041 1.1004 1.1015
irintensity: 0.7480 0.7924 0.4968 1.5034 2.2762 0.5098 0.6496 1.0199 1.5570 2.6075 0.8205 2.2424 4.8884 2.7708 4.7382 3.7498 0.3459 5.5510 3.3005 1.1166 1.6544 13.8612 34.2095 11.9062 9.4916 84.4718 27.8653 59.8310 18.0695 23.7330 10.3891 19.8518 36.3641 0.8099 90.2509 18.0800 25.9121 285.2019 199.1770 0.5645 9.8357 27.4849 0.2215 86.3013 5.2541 99.1412 1.2792 5.2948 9.3399 41.3048 5.1677 0.4290 4.9919 6.3293 12.7195 21.0088 14.0815 15.2986 7.0728 14.7916 3.8954 13.5574 13.3238 9.6559 36.0719 26.4946 4.4432 29.2858 31.5549 1.7860 1.5112 22.8679 9.9600 39.7323 5.9730 26.0293 8.9857 12.6898
temp: 298.150 k
press: 1.00000 atm
elementType: 16 16 15 9 9 9 8 6 6 6 6 6 6 6 1 1 1 1 1 1 1 1 1 1 1 1 1 1
symmnumber: 1
zpe: 544625.7 jmol-1
zpe.correction: 0.207437 hartree
zpe.thermalcorrener: 0.226447 hartree
zpe.thermalcorrenthalpy: 0.227392 hartree
zpe.thermalcorrgfe: 0.157090 hartree
zpe.sumelectzpe: -1786.106181 hartree
zpe.sumelectthermal: -1786.087171 hartree
zpe.sumelectthermalent: -1786.086226 hartree
zpe.sumelectthermalfe: -1786.156528 hartree
dipole: 0.2732 1.9784 2.2304
dipole: 2.9939
quadrupole: -102.1232 -106.8421 -109.2734
quadrupole: 14.2056 -3.3465 6.9316
quadrupole: 3.9564 -0.7626 -3.1938 14.2056 -3.3465 6.9316
hfenergy: -1786.3136179 hartree
pointgroup: C01 [X(C7H14F3O1P1S2)]
dipole: 0.0407958 -0.9385256 -0.7105908 debye
polarizability: 175.6136056|-12.8740986|141.9563213|-17.6043563|-13.1831113|126.1495634 unknown
InChI: InChI=1S/C4H7F3OPS.C3H7S/c1-2-9(10)8-3-4(5,6)7;1-2-3-4/h2-3H2,1H3;2-3H2,1H3
charge 0 multiplicity 1
28 atoms
S  -1.275562 1.011086 -0.90493
S  -1.271242 -1.615938 1.691811
P  -0.21759 -0.731411 0.148687
F  1.799114 1.153993 -1.940982
F  3.964276 1.406604 -1.297005
F  2.312403 2.498974 -0.184684
O  1.2994 -0.060125 0.842509
C  0.300927 -1.866552 -1.266311
C  -2.732985 1.248742 0.299264
C  -4.009034 0.536963 -0.173469
C  1.00208 -3.148758 -0.781127
C  2.553432 0.067772 0.124337
C  -5.18609 0.8155 0.79047
C  2.637605 1.28753 -0.801391
H  -0.644823 -2.103165 -1.784685
H  0.916823 -1.27139 -1.963848
H  -2.854998 2.343895 0.364818
H  -2.4030 0.86338 1.282543
H  -4.269671 0.87019 -1.196073
H  -3.814771 -0.550868 -0.222194
H  1.226503 -3.794627 -1.648895
H  1.951127 -2.941067 -0.255778
H  0.354753 -3.711343 -0.086813
H  2.807157 -0.820883 -0.485212
H  3.317629 0.19087 0.910365
H  -5.411824 1.896918 0.848759
H  -6.100344 0.297455 0.449157
H  -4.955697 0.459353 1.811377
