program: Gaussian 09
title: 000187497
version: EM64L-G09RevD.01
frameworkgroup: C1[X(C4H2Cl6O)]
method: RPBEPBE
basis: SDD
operation: Freq
keyword: #p
keyword: freq=noraman
keyword: PBEPBE/SDD
title: #p freq=noraman PBEPBE/SDD
converged: NO YES NO NO
title: Mulliken charges:
elementType: Cl Cl Cl Cl Cl Cl O C C C C H H
charge: 0.129935 0.165280 0.121793 0.122892 0.096578 0.119103 -0.091226 -0.343812 -0.392197 -0.271166 -0.215472 0.273905 0.284388
chargesum: 0.00000
title: Mulliken charges with hydrogens summed into heavy atoms:
elementType: Cl Cl Cl Cl Cl Cl O C C C C
charge: 0.129935 0.165280 0.121793 0.122892 0.096578 0.119103 -0.091226 -0.343812 -0.392197 -0.271166 0.342821
polarizability: 1.02885688e+02 1.59118421e+00 1.15657121e+02 4.06368753e+00 9.88436242e+00 8.15894750e+01
1716.lowfreq: 0.0020 0.0026 0.0037 7.7190 9.7323 13.6701 57.4469 89.0962 145.2592
frequency: 57.3695 89.0782 145.2565 148.0191 174.0845 199.8047 216.1293 222.3665 248.7009 269.0456 309.1307 316.0594 332.5640 353.6454 421.1176 448.1548 518.3376 643.6158 682.0467 719.3485 798.8734 848.0760 878.2756 968.6555 986.9946 999.1476 1042.6551 1096.6766 1166.9494 1321.6569 1456.4504 3056.3676 3149.1948
redmass: 15.3501 19.9705 26.4672 25.8000 14.4573 27.6757 26.8734 28.1977 18.0146 8.7534 8.4079 21.5986 7.7235 13.9018 9.0849 14.4665 8.8712 5.6451 10.4476 9.8735 8.1127 11.7701 7.7303 8.7815 5.5042 5.0216 2.8342 5.7297 1.1200 1.2746 1.0794 1.0602 1.1083
irintensity: 0.6274 0.4009 0.6110 0.0957 0.7910 0.3368 0.3783 0.2715 1.4495 2.5283 0.6605 1.0658 3.0563 2.0865 11.2259 5.9087 33.5290 83.1038 127.0874 54.8782 17.4568 66.1478 18.5513 276.8887 23.6824 24.5265 17.0420 14.6652 4.0529 3.5931 17.4455 8.1390 0.5496
temp: 298.150 k
press: 1.00000 atm
elementType: 17 17 17 17 17 17 8 6 6 6 6 1 1
symmnumber: 1
zpe: 145249.7 jmol-1
zpe.correction: 0.055323 hartree
zpe.thermalcorrener: 0.067291 hartree
zpe.thermalcorrenthalpy: 0.068235 hartree
zpe.thermalcorrgfe: 0.016019 hartree
zpe.sumelectzpe: -2988.313298 hartree
zpe.sumelectthermal: -2988.301329 hartree
zpe.sumelectthermalent: -2988.300385 hartree
zpe.sumelectthermalfe: -2988.352601 hartree
dipole: -2.0278 -0.5352 -1.4124
dipole: 2.5285
quadrupole: -108.6564 -104.4636 -101.0536
quadrupole: -0.6624 4.9041 1.1838
quadrupole: -3.9319 0.2610 3.6709 -0.6624 4.9041 1.1838
hfenergy: -2988.3686207 hartree
pointgroup: C01 [X(C4H2Cl6O1)]
dipole: -0.7878841 0.0015185 -0.6073081 debye
dipolederiv: -0.1290779 -0.0082421 -0.0152996 0.0053701 -0.4804296 -0.2594454 -0.0098305 -0.1593663 -0.2677989 -0.0548101 -0.0030827 0.0196274 -0.0048769 -0.0869221 0.0899161 0.0070032 0.0466369 -0.5289189 -0.5026404 -0.210589 -0.0673952 -0.2162524 -0.2327462 -0.0511885 -0.0211462 -0.0445045 -0.0923423 -0.143048 0.1101702 0.0497116 0.0228477 -0.4526477 -0.201936 0.011221 -0.1958089 -0.2086713 -0.2675001 -0.1346381 -0.1381148 -0.1398397 -0.4492684 -0.3355027 -0.1380374 -0.2657203 -0.395349 -0.5725714 0.2760025 0.0538184 0.2720217 -0.3196848 -0.0678933 0.0675095 -0.0788512 -0.1223303 -0.897757 0.0175046 -0.274938 0.2223018 -0.3439854 0.256577 -0.6020346 0.1183928 -0.7994549 0.10019 -0.0311887 0.0210501 -0.0125544 0.464508 0.1404819 0.0069293 0.067573 0.8922643 0.6698283 0.1268072 0.0771623 0.1543161 0.7830941 0.2877903 -0.01498 0.3317049 0.2297683 1.2272737 -0.1266743 0.106511 -0.3899265 0.9845316 0.1901151 0.6872617 0.2949646 1.0135231 0.5804443 -0.0374911 0.2230295 0.1044661 0.081002 -0.0025504 0.0298391 -0.0732696 0.1227671 -0.0170144 -0.013338 -0.02541 -0.0554297 0.0358694 -0.0973256 -0.0027576 -0.0601609 0.0507224 0.006683 0.0347594 -0.0297526 0.0375562 0.0166791 0.0509615 -0.0209775 0.0184095 0.1058204 unknown
polarizability: 102.7420152|-0.3115736|104.4788293|4.4332505|18.8226505|92.9114399 unknown
InChI: InChI=1S/C4H2Cl6O/c5-2(6)1-11-4(9,10)3(2,7)8/h1H2
charge 0 multiplicity 1
13 atoms
Cl -0.055206 -2.25959 -0.462943
Cl -0.058917 -0.869363 2.201908
Cl -2.827925 -0.688214 -0.325141
Cl -1.573176 1.755952 0.86464
Cl 1.768373 1.585172 1.052925
Cl 2.738816 -0.799676 -0.446378
O  0.791359 0.814937 -1.366435
C  -0.028729 -0.58333 0.404063
C  -1.233234 0.240849 -0.175993
C  1.218505 0.230982 -0.14654
C  -0.691236 0.661585 -1.554765
H  -0.857759 -0.128564 -2.305062
H  -1.081267 1.630561 -1.893979
