program: Gaussian 09
title: 000187502
version: EM64L-G09RevD.01
frameworkgroup: C1[X(C18H12)]
method: RPBEPBE
basis: SDD
operation: Freq
keyword: #p
keyword: freq=noraman
keyword: PBEPBE/SDD
title: #p freq=noraman PBEPBE/SDD
converged: YES YES NO YES
title: Mulliken charges:
elementType: C C C C C C C C C C C C C C C C C C H H H H H H H H H H H H
charge: 0.005367 0.017047 0.483828 0.472804 0.474552 0.473672 -0.494196 -0.488905 -0.481825 -0.481418 -0.661187 -0.686389 0.553043 -0.464186 -0.464898 -0.242047 -0.222910 -0.575734 0.237948 0.238107 0.236562 0.236492 0.237565 0.240555 0.241319 0.241325 0.226632 0.218014 0.216175 0.212689
chargesum: 0.00000
title: Mulliken charges with hydrogens summed into heavy atoms:
elementType: C C C C C C C C C C C C C C C C C C
charge: 0.005367 0.017047 0.483828 0.472804 0.474552 0.473672 -0.256248 -0.250798 -0.245263 -0.244926 -0.423622 -0.445834 0.553043 -0.222867 -0.223573 -0.015415 -0.004896 -0.146870
polarizability: 3.78111045e+02 6.84778031e+00 2.14249764e+02 -4.71460426e-03 -1.06876942e-02 7.26902299e+01
1716.lowfreq: -7.0091 -0.0009 -0.0002 0.0004 4.7746 10.6681 51.3157 94.2264 154.1109
frequency: 51.3029 94.2237 154.1108 163.4423 179.0472 219.1104 249.3364 313.7761 323.5265 366.8018 397.9901 449.9652 471.5321 492.9949 498.4871 513.8559 514.2204 538.7511 552.9465 573.0204 578.1474 608.1875 694.9026 712.4542 741.8848 751.1799 759.2507 772.2285 808.9310 823.0770 837.5379 869.2456 899.5822 920.1026 928.2201 933.2109 934.1608 976.0143 976.8637 985.5907 989.8027 990.7477 1012.9662 1052.6762 1081.6112 1119.9317 1142.6110 1172.2169 1180.9916 1191.2350 1222.6678 1248.5915 1255.2646 1292.9828 1309.2970 1339.9373 1377.7414 1386.5427 1414.7241 1432.7240 1434.3706 1437.4251 1450.5885 1464.9563 1482.7592 1497.6675 1567.0770 1594.5054 1605.4854 1613.1119 1637.2203 1648.4724 3088.3240 3104.0399 3114.2269 3119.3784 3119.6490 3122.7398 3132.0141 3134.7754 3144.3303 3144.9004 3156.9506 3204.4027
redmass: 3.9457 2.8040 4.1148 3.7395 3.0208 3.9111 3.4093 5.1837 3.5637 4.9642 3.3739 4.8172 5.8767 5.1010 3.0407 4.8606 3.2196 2.9494 6.7467 2.5197 4.7484 4.2318 3.6077 2.1017 1.8789 5.9363 5.0083 1.2967 4.9533 1.3421 2.0954 2.7735 1.4407 1.5212 1.8382 1.4785 3.3875 4.6869 1.3764 1.3926 7.4204 1.4214 1.1869 1.6787 1.8754 2.4856 1.4875 1.2627 1.3348 1.2461 1.7868 1.4538 1.8189 2.5997 1.4110 2.8895 2.0510 3.9977 2.2731 1.8690 4.1529 3.2406 3.1544 3.7160 4.5556 4.2967 4.4990 7.5889 6.5902 6.0424 6.6021 4.7763 1.0795 1.0723 1.0911 1.0860 1.0862 1.0860 1.0918 1.0908 1.0981 1.0979 1.0989 1.1139
irintensity: 0.2068 0.4975 0.0314 0.3823 2.6214 9.3994 0.0638 0.3695 0.9073 1.5603 0.0100 0.8955 0.4014 3.8952 0.1189 0.3959 1.2561 0.0126 1.6062 3.3454 0.6561 1.4576 0.1352 19.2511 36.5610 0.0200 0.0096 3.8540 4.7685 0.1337 11.0210 60.0229 0.0748 0.2898 7.0732 147.3604 2.6059 0.5000 5.0676 0.1121 1.7450 0.6650 30.2438 16.1743 0.9155 0.1983 3.9757 4.0952 7.0765 17.6733 1.5281 0.0473 4.2612 0.1551 1.8566 0.0774 3.2975 5.3994 7.7349 0.1050 3.3975 3.5165 10.8732 1.2912 1.8818 0.3670 0.5922 0.9672 2.4961 22.8567 1.4267 23.7722 22.4533 6.4294 14.3012 1.3341 3.3742 0.0876 13.4038 7.1682 68.7145 0.1236 45.5636 27.2934
temp: 298.150 k
press: 1.00000 atm
elementType: 6 6 6 6 6 6 6 6 6 6 6 6 6 6 6 6 6 6 1 1 1 1 1 1 1 1 1 1 1 1
symmnumber: 1
zpe: 621243.8 jmol-1
zpe.correction: 0.236619 hartree
zpe.thermalcorrener: 0.249288 hartree
zpe.thermalcorrenthalpy: 0.250232 hartree
zpe.thermalcorrgfe: 0.197892 hartree
zpe.sumelectzpe: -691.961969 hartree
zpe.sumelectthermal: -691.949301 hartree
zpe.sumelectthermalent: -691.948357 hartree
zpe.sumelectthermalfe: -692.000697 hartree
dipole: 0.2700 0.0556 0.0003
dipole: 0.2756
quadrupole: -89.1453 -88.0877 -113.0592
quadrupole: -0.2958 0.0018 -0.0030
quadrupole: 7.6188 8.6763 -16.2951 -0.2958 0.0018 -0.0030
hfenergy: -692.1985887 hartree
pointgroup: C01 [X(C18H12)]
dipole: -0.1060273 -0.0227144 0.0012255 debye
polarizability: 377.9790243|8.1140118|214.3149147|-2.1044706|-2.7770945|72.7570998 unknown
InChI: InChI=1S/C18H12/c1-2-12-10-15-8-6-13-4-3-5-14-7-9-16(11-12)18(15)17(13)14/h2-11H,1H2
charge 0 multiplicity 1
30 atoms
C  0.092788 -0.058283 -0.017144
C  -1.339877 0.023319 -0.009324
C  0.891971 1.14439 -0.045528
C  0.747847 -1.342576 0.003544
C  -2.132194 -1.182643 0.019223
C  -1.990813 1.311185 -0.029969
C  0.211741 2.424773 -0.065822
C  -0.069997 -2.537699 0.032113
C  -1.451335 -2.460288 0.03958
C  -1.168551 2.503939 -0.058404
C  2.303796 1.043669 -0.052626
C  2.164797 -1.394225 -0.004532
C  2.958798 -0.217345 -0.03251
C  -3.549825 -1.07907 0.026528
C  -3.410046 1.368744 -0.021803
C  -4.178533 0.18416 0.006178
C  4.430733 -0.36211 -0.038973
C  5.362212 0.63057 -0.062525
H  0.819698 3.337058 -0.087387
H  0.431133 -3.512787 0.047893
H  -2.058128 -3.373297 0.061268
H  -1.66837 3.47968 -0.074148
H  2.89558 1.965969 -0.07393
H  2.661623 -2.37298 0.011545
H  -4.153668 -1.993857 0.048232
H  -3.907239 2.345729 -0.037574
H  -5.272166 0.246699 0.012108
H  4.790738 -1.401591 -0.022905
H  6.432202 0.398921 -0.06503
H  5.095585 1.693751 -0.079979
