program: Gaussian 09
title: 000185084
version: EM64L-G09RevD.01
frameworkgroup: C1[X(C8H16F3OPS2)]
method: RPBEPBE
basis: SDD
operation: Freq
keyword: #p
keyword: freq=noraman
keyword: PBEPBE/SDD
title: #p freq=noraman PBEPBE/SDD
converged: YES YES NO NO
title: Mulliken charges:
elementType: S S P F F F O C C C C C C C C H H H H H H H H H H H H H H H H
charge: -0.037505 -0.218939 0.405186 -0.175282 -0.168063 -0.157983 -0.442525 -0.332797 -0.334903 -0.579079 -0.642583 -0.668601 -0.618159 -0.334228 0.451376 0.292214 0.214885 0.209770 0.280071 0.273400 0.220699 0.233728 0.222041 0.229257 0.217551 0.215657 0.230041 0.240088 0.252811 0.255933 0.265938
chargesum: 0.00000
title: Mulliken charges with hydrogens summed into heavy atoms:
elementType: S S P F F F O C C C C C C C C
charge: -0.037505 -0.218939 0.405186 -0.175282 -0.168063 -0.157983 -0.442525 -0.040583 0.089752 -0.025607 0.033885 -0.006135 0.104782 0.187642 0.451376
polarizability: 1.76785920e+02 1.23511446e+01 1.64999585e+02 -6.62719170e+00 5.99900272e+00 1.34843048e+02
1716.lowfreq: -10.9417 -6.7636 -6.0122 0.0008 0.0017 0.0023 17.9018 28.0428 30.2085
frequency: 16.5222 28.0081 28.8248 40.0754 50.7023 69.3609 93.9438 98.5433 113.2296 134.8059 148.6913 176.9527 189.9834 199.3080 220.8687 225.2250 237.8775 254.8848 280.9102 287.2844 321.1244 328.8574 360.7597 385.3600 431.8670 443.4144 459.9534 480.3533 514.2536 550.4271 568.0486 613.6098 671.6325 748.1474 783.8125 786.5715 835.5446 889.5836 963.3616 991.5325 995.0559 1010.5620 1024.4426 1036.8647 1051.5775 1054.3923 1079.9741 1091.6392 1116.2914 1159.1674 1206.2285 1240.8806 1245.5848 1271.0299 1277.0585 1288.0866 1290.3538 1342.2820 1371.1238 1388.8865 1393.2854 1397.5631 1422.8996 1428.4686 1457.0513 1467.5576 1469.5899 1471.4900 1475.3009 1484.5678 1485.3226 2970.5438 2977.0066 2982.4402 2984.6415 2991.1565 2994.6590 3025.2171 3028.3618 3069.8490 3079.7789 3087.9828 3088.3502 3088.5988 3089.6319 3094.7921 3114.8225
redmass: 6.3850 4.3782 3.8401 6.2887 10.4506 3.2436 4.9076 1.8712 5.7058 3.8390 7.6026 2.1989 5.4187 2.4493 1.4195 1.7010 1.5830 3.2393 2.3875 6.2246 2.8830 4.0909 3.9048 3.6889 7.6319 3.0210 7.1862 8.5173 9.5878 3.9637 7.6000 8.9628 5.7592 7.9491 1.2015 1.2049 2.0348 2.9975 1.2580 1.7948 1.4072 7.2082 8.0183 3.0269 1.4469 2.0123 1.4477 2.4369 2.5076 2.1120 7.2493 1.2176 1.1896 1.2407 1.2635 1.1686 1.2486 1.5279 1.2591 1.2061 1.2099 1.1796 1.0799 1.0852 1.0640 1.0553 1.0362 1.0467 1.0402 1.0478 1.0530 1.0589 1.0383 1.0790 1.0425 1.0626 1.0357 1.0996 1.0581 1.0977 1.0999 1.1000 1.1000 1.1004 1.1010 1.1017 1.1029
irintensity: 1.1192 0.0960 0.0711 2.1280 1.0557 0.8971 2.7840 0.1738 2.1576 1.3998 0.7218 1.6814 1.1207 3.1618 2.7640 4.0519 0.5642 8.6034 1.9823 4.2262 2.1120 0.5526 12.9219 2.2668 15.4363 4.5976 0.0963 63.6911 73.9522 11.4474 15.6880 73.0191 23.0581 21.1297 29.5519 32.5984 4.1011 95.5664 8.4525 13.1024 37.8262 100.9867 337.8406 2.1843 3.1458 39.9536 7.9030 77.8837 1.4096 5.2957 124.2684 1.7287 1.4196 28.6987 16.5482 22.5188 0.5036 5.8932 10.0687 11.4112 24.9932 20.3939 5.7750 13.4667 3.6643 18.1742 16.4288 2.0019 20.6009 10.3216 12.3935 22.8016 41.2886 14.2770 15.2820 34.8583 23.9495 8.6300 4.2221 26.8125 36.5480 4.2063 30.9165 14.7639 22.6324 3.8811 11.0734
temp: 298.150 k
press: 1.00000 atm
elementType: 16 16 15 9 9 9 8 6 6 6 6 6 6 6 6 1 1 1 1 1 1 1 1 1 1 1 1 1 1 1 1
symmnumber: 1
zpe: 617193.1 jmol-1
zpe.correction: 0.235076 hartree
zpe.thermalcorrener: 0.255523 hartree
zpe.thermalcorrenthalpy: 0.256468 hartree
zpe.thermalcorrgfe: 0.182736 hartree
zpe.sumelectzpe: -1825.340320 hartree
zpe.sumelectthermal: -1825.319873 hartree
zpe.sumelectthermalent: -1825.318929 hartree
zpe.sumelectthermalfe: -1825.392660 hartree
dipole: -2.3375 -1.0860 -0.7558
dipole: 2.6860
quadrupole: -114.7744 -114.0445 -113.7785
quadrupole: 8.8585 1.9261 -11.3728
quadrupole: -0.5752 0.1546 0.4206 8.8585 1.9261 -11.3728
hfenergy: -1825.5753964 hartree
pointgroup: C01 [X(C8H16F3O1P1S2)]
dipole: 0.9571894 0.3409872 -0.290263 debye
polarizability: 174.0280258|16.5937783|158.8902108|7.2911574|-11.9195698|143.7103159 unknown
InChI: InChI=1S/C4H7F3OPS.C4H9S/c1-2-9(10)8-3-4(5,6)7;1-3-4(2)5/h2-3H2,1H3;4H,3H2,1-2H3
charge 0 multiplicity 1
31 atoms
S  1.257708 0.368496 -0.942221
S  1.066621 -1.68532 2.141657
P  0.11906 -1.12755 0.391983
F  -2.13999 0.125003 -2.053701
F  -3.12462 2.089409 -1.457008
F  -3.972399 0.115315 -0.722266
O  -1.483019 -0.387914 0.733337
C  2.620775 0.939711 0.30439
C  3.924834 1.165701 -0.493607
C  -0.378982 -2.503288 -0.785479
C  2.144124 2.18098 1.07325
C  4.536098 -0.113042 -1.101044
C  -1.381522 -3.477856 -0.140405
C  -1.864888 0.923087 0.246881
C  -2.771653 0.80375 -0.979642
H  2.734117 0.079244 0.994292
H  3.754347 1.924357 -1.28301
H  4.646607 1.618909 0.217218
H  -0.800998 -2.005908 -1.676015
H  0.562018 -3.005625 -1.070378
H  2.92938 2.497643 1.786822
H  1.231172 1.966184 1.655901
H  1.94035 3.024878 0.389837
H  3.852113 -0.570151 -1.837399
H  5.488506 0.114872 -1.612765
H  4.742242 -0.864874 -0.316831
H  -1.623303 -4.278837 -0.862064
H  -0.960725 -3.945272 0.766866
H  -2.317783 -2.96372 0.133937
H  -0.990147 1.539384 -0.04022
H  -2.434045 1.420434 1.049782
