program: Gaussian 09
title: 000187505
version: EM64L-G09RevD.01
frameworkgroup: C1[X(C20H12Br2O2)]
method: RPBEPBE
basis: SDD
operation: Freq
keyword: #p
keyword: freq=noraman
keyword: PBEPBE/SDD
title: #p freq=noraman PBEPBE/SDD
converged: YES YES NO NO
title: Mulliken charges:
elementType: Br Br O O C C C C C C C C C C C C C C C C C C C C H H H H H H H H H H H H
charge: 0.013747 0.013737 -0.226113 -0.226102 -0.003932 -0.003933 0.291835 0.291865 0.520884 0.520885 0.201669 0.201713 -0.417082 -0.417116 -0.506858 -0.506888 -0.536544 -0.536559 -0.368880 -0.368885 0.184675 0.184659 -0.830907 -0.830910 0.315059 0.315049 0.248702 0.248702 0.252180 0.252181 0.253194 0.253173 0.285259 0.323146 0.285242 0.323154
chargesum: 0.00000
title: Mulliken charges with hydrogens summed into heavy atoms:
elementType: Br Br O O C C C C C C C C C C C C C C C C C C C C
charge: 0.013747 0.013737 -0.226113 -0.226102 -0.003932 -0.003933 0.291835 0.291865 0.520884 0.520885 0.201669 0.201713 -0.102023 -0.102067 -0.258156 -0.258185 -0.284364 -0.284378 -0.115686 -0.115712 0.184675 0.184659 -0.222501 -0.222515
polarizability: 5.25268856e+02 -2.71923427e+00 2.65644024e+02 6.63769991e-03 -2.96930397e-04 1.44125469e+02
1716.lowfreq: -6.2345 -1.4427 0.0003 0.0005 0.0008 3.1451 7.9790 13.0619 30.1742
frequency: 7.9784 12.9778 30.1586 42.0416 49.2225 86.4248 96.8581 121.7679 122.5612 160.0439 197.0078 213.6883 234.9123 267.5018 290.5261 294.9919 332.2405 361.9655 376.7863 406.5055 435.9424 465.2696 466.5979 485.5592 501.2099 503.5945 516.9533 519.6083 554.5867 562.6308 576.7550 590.7242 613.5623 648.3176 688.0038 699.6660 702.8387 713.4454 741.5415 754.8711 759.9601 810.2443 821.5526 833.8018 850.9501 872.9758 884.9169 889.4262 892.6941 898.8532 970.4405 974.4166 975.2330 999.1790 1023.5908 1024.0896 1062.5331 1093.1291 1122.7321 1134.9533 1154.4649 1168.1308 1194.0171 1208.2382 1217.0114 1227.8627 1228.1696 1253.5588 1258.0081 1260.5290 1263.9670 1337.2135 1361.3972 1382.8968 1385.0792 1403.3530 1431.4695 1434.3948 1442.2893 1450.7350 1463.0617 1502.4951 1508.7225 1521.6479 1542.5635 1556.8538 1585.1396 1598.0289 1608.7293 1627.1245 3065.0728 3065.0834 3135.2332 3135.3987 3140.1569 3140.4448 3161.6592 3161.6781 3179.9149 3180.0378 3191.3662 3191.6750
redmass: 24.7728 10.4977 9.2624 9.6329 10.9837 8.2295 8.7980 5.4535 11.1412 4.4774 4.9868 5.8569 4.7228 4.3291 5.0324 4.5349 6.8817 4.3796 6.8894 4.5163 5.0071 5.5124 6.8431 4.5845 4.8503 3.8519 3.9399 5.5278 3.8915 4.5850 4.5746 5.7954 5.2809 5.1951 6.7119 4.6096 5.4096 3.6673 3.7949 3.3449 2.9358 5.0517 1.4161 1.8828 5.0107 5.1560 1.6769 1.6161 1.8535 1.8266 3.4963 1.4375 1.5179 3.9471 1.3473 1.3397 1.5444 1.3958 2.4776 2.0312 1.9537 1.7461 1.3063 1.5543 1.7026 1.2287 1.2442 2.2740 2.5670 1.8517 2.0766 2.9477 3.4816 2.6775 5.6525 6.6538 3.4706 1.3942 1.1430 1.5103 5.8788 4.9090 4.3331 4.2810 6.6068 7.8403 6.7513 7.1255 6.1409 7.3612 1.0581 1.0581 1.0911 1.0910 1.0898 1.0898 1.1086 1.1086 1.0934 1.0934 1.0947 1.0947
irintensity: 0.3316 0.9830 1.9727 0.4399 1.5130 0.3634 2.8231 0.0084 4.1009 5.8722 2.0869 2.0898 7.4444 0.1208 1.2978 0.2978 13.2581 11.6741 0.1843 1.0387 0.1080 3.2080 5.4029 0.9956 2.3903 0.6802 5.3139 13.5021 31.3973 63.8543 15.3731 3.0586 4.5635 2.2061 9.5557 3.2609 81.1988 6.7438 5.4849 3.2188 0.4528 6.9899 0.2024 10.8564 0.2707 0.2828 3.2318 135.0970 1.4775 1.9697 11.4330 6.6659 1.0430 50.1637 0.4870 0.6172 5.0363 114.1025 0.7190 0.9988 16.5056 0.0256 17.7057 0.4856 49.7809 15.1084 50.6767 203.3756 11.3531 3.9064 409.3648 1.7195 100.5283 1.2272 2.3226 0.0073 0.1747 13.2220 5.3035 84.1299 40.3729 97.3322 0.3502 0.0485 680.7352 1.8826 59.1754 0.0536 83.1517 0.8971 12.7925 6.8419 16.2485 0.0239 20.7114 0.0468 3.4842 0.5849 27.9984 0.3186 0.0961 31.9811
temp: 298.150 k
press: 1.00000 atm
elementType: 35 35 8 8 6 6 6 6 6 6 6 6 6 6 6 6 6 6 6 6 6 6 6 6 1 1 1 1 1 1 1 1 1 1 1 1
symmnumber: 1
zpe: 679887.9 jmol-1
zpe.correction: 0.258956 hartree
zpe.thermalcorrener: 0.278779 hartree
zpe.thermalcorrenthalpy: 0.279724 hartree
zpe.thermalcorrgfe: 0.205182 hartree
zpe.sumelectzpe: -945.108646 hartree
zpe.sumelectthermal: -945.088823 hartree
zpe.sumelectthermalent: -945.087878 hartree
zpe.sumelectthermalfe: -945.162420 hartree
dipole: 0.0012 0.0002 -2.7247
dipole: 2.7247
quadrupole: -164.2454 -150.5639 -160.3169
quadrupole: -21.9684 -0.0008 -0.0003
quadrupole: -5.8700 7.8115 -1.9415 -21.9684 -0.0008 -0.0003
hfenergy: -945.3676021 hartree
pointgroup: C01 [X(C20H12Br2O2)]
dipole: 0.0008427 -0.0011586 1.071976 debye
polarizability: 513.6835239|53.6750802|277.2291955|-0.0793283|0.1226368|144.1256297 unknown
InChI: InChI=1S/C20H12Br2O2/c21-9-17(23)13-5-1-11-3-7-16-14(18(24)10-22)6-2-12-4-8-15(13)19(11)20(12)16/h1-8H,9-10H2
charge 0 multiplicity 1
36 atoms
Br 5.965221 1.58557 -2.04705
Br -5.967023 -1.581452 -2.046171
O  4.728154 -1.297392 0.05785
O  -4.728163 1.296778 0.064111
C  0.612086 0.382486 -0.098664
C  -0.612023 -0.38259 -0.099075
C  1.904566 -0.274753 -0.096057
C  -1.904504 0.274638 -0.09412
C  0.535518 1.821411 -0.103364
C  -0.535446 -1.821504 -0.106993
C  3.106804 0.531108 -0.098345
C  -3.106742 -0.531238 -0.097346
C  1.92834 -1.723178 -0.102382
C  -1.928264 1.72308 -0.097207
C  -0.755112 2.456976 -0.104347
C  0.755185 -2.457062 -0.110301
C  1.733785 2.584431 -0.112901
C  -1.733714 -2.584511 -0.117324
C  2.980903 1.951458 -0.113705
C  -2.980834 -1.951549 -0.115866
C  4.481808 -0.05659 -0.071171
C  -4.481769 0.056306 -0.067961
C  5.710553 0.860453 -0.162803
C  -5.710498 -0.860663 -0.160504
H  2.897784 -2.222413 -0.095339
H  -2.897695 2.222305 -0.088367
H  -0.7965 3.552213 -0.111326
H  0.796574 -3.55228 -0.119715
H  1.671827 3.678013 -0.124419
H  -1.671757 -3.678065 -0.131242
H  3.87598 2.576889 -0.141951
H  -3.875932 -2.576922 -0.144821
H  5.678981 1.742915 0.493398
H  6.60555 0.25362 0.027718
H  -5.678177 -1.744622 0.493645
H  -6.605366 -0.254366 0.032313
