program: Gaussian 09
title: 000185081
version: EM64L-G09RevD.01
frameworkgroup: C1[X(C6H6ClFN2O)]
method: RPBEPBE
basis: SDD
operation: Freq
keyword: #p
keyword: freq=noraman
keyword: PBEPBE/SDD
title: #p freq=noraman PBEPBE/SDD
converged: YES YES NO NO
title: Mulliken charges:
elementType: Cl F O N N C C C C C C H H H H H H
charge: -0.025535 -0.222857 -0.413947 -0.414827 -0.569142 0.336089 -0.495604 0.144216 0.463171 -0.320268 -0.304762 0.269137 0.275246 0.313720 0.303160 0.302489 0.359712
chargesum: 0.00000
title: Mulliken charges with hydrogens summed into heavy atoms:
elementType: Cl F O N N C C C C C C
charge: -0.025535 -0.222857 -0.054235 -0.101106 0.036507 0.336089 -0.226467 0.144216 0.463171 -0.045023 -0.304762
polarizability: 1.43348418e+02 3.77167738e+00 9.77675061e+01 3.98072498e-02 1.06410542e-02 4.10337796e+01
1716.lowfreq: -4.7274 -4.5187 -2.9274 0.0011 0.0017 0.0021 69.5100 118.2117 168.7238
frequency: 69.4927 118.2111 168.7222 170.2559 209.8915 245.7363 290.1804 300.8092 317.7675 324.9760 367.1241 440.1699 447.2955 461.9708 503.7865 563.2303 592.5245 626.0771 651.4121 689.3735 718.4308 809.1433 829.4817 849.4455 993.3309 1091.8088 1124.5748 1159.7883 1214.1474 1234.1254 1239.5589 1323.8849 1412.3496 1413.0130 1468.4045 1517.1570 1609.6397 1625.3335 1670.6183 3145.0438 3182.9233 3452.9709 3507.8828 3582.9862 3587.6041
redmass: 4.7477 6.6850 7.3073 5.2798 11.1625 3.4306 8.8863 1.2595 9.5854 1.1338 9.5781 3.0622 10.5758 2.1016 2.1375 1.1592 6.2762 6.1223 5.7586 2.8880 7.4321 5.7600 1.5916 1.3930 3.7203 3.9194 1.8503 1.7799 2.0049 1.1744 1.7177 4.3584 5.2260 7.8868 1.7334 2.9800 5.9448 3.8006 1.3139 1.0907 1.0930 1.0406 1.0765 1.1059 1.0660
irintensity: 5.9894 4.8243 0.3915 3.5874 3.1441 1.1317 4.5985 79.9705 2.7805 170.9715 1.4559 13.2959 1.4032 115.9062 131.6818 55.2276 9.7533 46.2794 3.7679 0.0932 40.5809 26.7875 1.9924 72.5802 7.9946 102.7904 177.3792 5.3674 32.8495 1.7612 41.2457 29.2951 24.1680 55.5714 14.6903 229.8431 17.6058 45.1565 61.8487 2.5788 0.3377 1.5633 44.8194 3.8658 36.9822
temp: 298.150 k
press: 1.00000 atm
elementType: 17 9 8 7 7 6 6 6 6 6 6 1 1 1 1 1 1
symmnumber: 1
zpe: 306977.6 jmol-1
zpe.correction: 0.116922 hartree
zpe.thermalcorrener: 0.127756 hartree
zpe.thermalcorrenthalpy: 0.128701 hartree
zpe.thermalcorrgfe: 0.080506 hartree
zpe.sumelectzpe: -976.009571 hartree
zpe.sumelectthermal: -975.998736 hartree
zpe.sumelectthermalent: -975.997792 hartree
zpe.sumelectthermalfe: -976.045987 hartree
dipole: -5.6745 -2.3806 0.0294
dipole: 6.1537
quadrupole: -60.4858 -63.1377 -71.0405
quadrupole: 7.6202 -0.1357 0.0316
quadrupole: 4.4022 1.7503 -6.1525 7.6202 -0.1357 0.0316
hfenergy: -976.1264926 hartree
pointgroup: C01 [X(C6H6Cl1F1N2O1)]
dipole: -2.1866032 1.0340123 -0.105243 debye
dipolederiv: -0.7587136 0.0844721 -0.0281634 0.1327381 -0.0998339 0.005489 -0.0281702 0.0036201 -0.0426996 -0.5389586 -0.3825971 -0.0131654 -0.4133241 -0.7739667 -0.0115198 -0.0127386 -0.0106978 -0.1348025 -0.4502407 -0.5950094 0.0011268 -0.6248644 -0.9557269 -0.0192813 0.0024417 -0.016633 -0.4051739 -1.0506547 0.0333417 -0.0145808 0.1215381 0.0513728 0.00276 0.0041231 -0.0062514 -0.5081781 -0.4817148 -0.2303162 -0.0180679 -0.4989183 -0.2266471 -0.0222505 -0.0229718 -0.006424 0.0253336 1.5394545 -0.1424364 0.0510327 -0.280777 -0.0412804 -0.0081898 0.0500375 -0.0037036 0.1473142 -0.4822764 -0.1105204 -0.0074307 -0.1623488 -0.1184293 -0.0076141 -0.0063109 -0.0050991 -0.2676535 0.0695194 0.318009 0.0025786 0.8065825 0.7198917 0.0256347 -0.0024375 0.0079792 -0.0401256 0.3345484 0.4413277 0.0053604 0.5623091 1.0348665 0.0148772 0.0039685 0.0093833 0.1214923 0.0340235 0.0587345 0.0026386 0.14323 -0.0349704 0.0054301 0.0023354 0.0015264 -0.057162 0.9069172 -0.0614334 0.0413491 -0.4276419 -0.2117092 -0.0159179 0.0431996 -0.0020188 -0.1596575 0.1162341 0.0131158 -0.0027493 0.0100336 -0.0388234 0.0022429 -0.0022865 0.0021779 0.1922266 0.1005769 0.0406438 -0.0034529 0.0320086 0.0229304 0.0023264 -0.0031038 0.0026749 0.1816749 0.1709122 0.0423889 -0.0098248 0.1033651 0.0211973 0.006331 -0.0167354 0.0028792 0.3672388 0.1488246 0.1498376 0.0900021 0.1694822 0.1869759 0.0438051 0.0649755 0.0064433 0.1062974 0.1610329 0.1483555 -0.0884753 0.1759007 0.1838087 -0.030158 -0.0678999 0.0072326 0.0899245 0.180515 0.1920862 -0.0081778 0.1506866 0.2803442 0.006035 -0.0084267 0.0069105 0.3839505 unknown
polarizability: 142.7719008|-5.7433206|98.1849627|3.9784565|-0.670601|41.1928402 unknown
InChI: InChI=1S/C6H6ClFN2O/c7-3-1-4(8)5(10-9)2-6(3)11/h1-2,10-11H,9H2
charge 0 multiplicity 1
17 atoms
Cl 3.472839 -0.534024 0.116602
F  -1.4131 -2.379809 -0.057599
O  1.997145 2.076588 0.040941
N  -2.542824 0.135911 -0.115059
N  -3.167166 1.385562 -0.162528
C  -1.149915 0.029906 -0.063586
C  -0.286547 1.15222 -0.039255
C  -0.545207 -1.253549 -0.0315
C  1.11778 0.986015 0.015917
C  0.836688 -1.446287 0.022697
C  1.676339 -0.314467 0.046752
H  -0.745848 2.146414 -0.065174
H  1.250232 -2.45768 0.045477
H  -3.090288 -0.727617 -0.139356
H  -3.689881 1.645927 0.67727
H  -3.607804 1.623359 -1.054821
H  1.492656 2.927232 0.019022
