program: Gaussian 09
title: 000185080
version: EM64L-G09RevD.01
frameworkgroup: C1[X(C9H12ClFN2O)]
method: RPBEPBE
basis: SDD
operation: Freq
keyword: #p
keyword: freq=noraman
keyword: PBEPBE/SDD
title: #p freq=noraman PBEPBE/SDD
converged: YES YES NO NO
title: Mulliken charges:
elementType: Cl F O N N C C C C C C C C C H H H H H H H H H H H H
charge: -0.033154 -0.218897 -0.264872 -0.409471 -0.543084 0.025770 0.581434 -0.691943 -0.688681 -0.528325 0.309409 -0.368554 0.155522 -0.328203 0.193057 0.212939 0.241257 0.235810 0.202267 0.237742 0.231207 0.249389 0.275922 0.331463 0.296190 0.295804
chargesum: 0.00000
title: Mulliken charges with hydrogens summed into heavy atoms:
elementType: Cl F O N N C C C C C C C C C
charge: -0.033154 -0.218897 -0.264872 -0.078008 0.048910 0.218827 0.581434 -0.001937 -0.017464 -0.278935 0.309409 -0.368554 0.155522 -0.052281
polarizability: 1.65249369e+02 -9.32151506e+00 1.52490039e+02 1.21897650e+00 2.05200677e+00 7.20136543e+01
1716.lowfreq: -3.8351 0.0008 0.0012 0.0017 5.2096 6.1186 40.6053 64.7829 71.2531
frequency: 40.5985 64.7796 71.2490 101.6836 118.3993 165.4443 173.6168 180.1971 205.5568 236.1736 248.8306 279.5162 302.7809 309.7905 325.0174 362.8993 393.3307 421.6398 443.3260 458.1724 500.4282 536.1517 575.2912 596.0556 614.2516 660.2568 691.1694 706.3064 817.3185 823.2489 830.2184 846.0305 908.7581 926.7806 939.6513 1010.4520 1102.9745 1104.8568 1147.8502 1152.1363 1181.2897 1219.5877 1234.5891 1242.3370 1314.1282 1326.7626 1342.0939 1377.7393 1381.9461 1397.8806 1400.1807 1454.5158 1458.8991 1467.6779 1469.8700 1489.0995 1498.7057 1597.9252 1618.1459 1663.2170 2970.8772 2989.2795 2996.4664 3085.3454 3094.9236 3098.0675 3106.3534 3169.6967 3182.8501 3424.0123 3552.2770 3577.3257
redmass: 4.2877 5.0719 2.9573 3.7906 6.0783 6.3102 7.0588 1.0441 2.9538 1.3739 2.7898 5.4888 3.2454 1.3822 5.6796 10.0612 3.5056 3.0529 3.0863 1.7733 2.3765 6.5534 1.2651 4.9432 6.3048 3.8900 2.6418 5.0870 5.2538 2.0093 3.2168 1.3722 2.9093 1.2900 1.3211 3.4962 6.2743 1.7964 2.0944 2.1114 1.9148 3.2823 1.6183 1.1753 1.3266 3.6272 1.4484 4.1445 1.3571 1.6610 2.8321 1.0497 1.5057 1.0571 1.0495 1.0582 3.7188 6.4194 6.2729 1.1019 1.0840 1.0360 1.0361 1.0990 1.1004 1.0997 1.1005 1.0889 1.0930 1.0398 1.1050 1.0782
irintensity: 0.0514 3.5934 0.1392 0.3926 2.0371 1.3176 1.4470 0.1305 1.1417 0.3733 0.3901 2.2472 1.1037 2.0988 5.9564 4.0789 3.3314 20.8483 5.7292 112.9505 199.1412 1.8529 151.9300 2.7071 20.2379 37.7838 1.3051 19.4989 31.5295 17.4570 26.1874 40.8542 24.0444 3.6135 1.1213 48.5027 17.3911 89.3533 72.2652 78.9693 24.1742 108.5812 12.0470 0.5097 35.9660 11.9658 14.1628 38.8051 22.4721 22.2818 117.6204 4.9775 1.9417 3.3295 3.7494 21.4512 315.2834 12.7734 117.2204 10.2012 32.2739 15.6097 21.2887 18.9946 21.5637 33.7073 31.2896 4.6998 0.3751 5.8985 0.4795 77.1490
temp: 298.150 k
press: 1.00000 atm
elementType: 17 9 8 7 7 6 6 6 6 6 6 6 6 6 1 1 1 1 1 1 1 1 1 1 1 1
symmnumber: 1
zpe: 525024.6 jmol-1
zpe.correction: 0.199971 hartree
zpe.thermalcorrener: 0.215171 hartree
zpe.thermalcorrenthalpy: 0.216115 hartree
zpe.thermalcorrgfe: 0.157523 hartree
zpe.sumelectzpe: -1093.678183 hartree
zpe.sumelectthermal: -1093.662983 hartree
zpe.sumelectthermalent: -1093.662039 hartree
zpe.sumelectthermalfe: -1093.720631 hartree
dipole: -1.1512 -4.7936 -0.1048
dipole: 4.9310
quadrupole: -91.5158 -83.4934 -89.6158
quadrupole: 6.1513 -0.2093 0.7709
quadrupole: -3.3075 4.7150 -1.4075 6.1513 -0.2093 0.7709
hfenergy: -1093.878154 hartree
pointgroup: C01 [X(C9H12Cl1F1N2O1)]
dipole: 0.5763513 1.8080747 -0.4029462 debye
dipolederiv: -0.2965597 0.3082511 -0.0432778 0.3149914 -0.5359376 0.0783933 -0.0437453 0.0808446 -0.0571614 -1.1082681 -0.1296519 0.1271534 -0.1196787 -0.2378753 0.0363088 0.1383109 0.0394011 -0.1536142 -1.6614035 -0.5461163 0.2059043 -0.5090507 -0.4806231 0.020097 0.318025 0.0740469 -0.3472415 -0.4871708 0.6463805 -0.1577045 0.4770712 -0.6113917 -0.0140365 -0.1006166 -0.0486822 -0.4438888 -0.6524642 0.5360004 -0.0639945 0.2641459 -0.1297016 0.0098872 0.0061082 -0.0151244 0.0295985 0.7745134 0.2712418 -0.0609811 0.626057 0.6131534 -0.0453531 -0.1610026 -0.0074066 0.4432975 1.4437817 0.4787842 -0.1680197 0.2842924 0.1227219 -0.0280224 -0.2303285 -0.0749835 0.1814343 -0.0548602 0.0014237 0.020112 -0.1293313 -0.0667112 -0.075307 0.0250879 -0.132998 -0.1320231 -0.1165726 0.0037027 0.0631419 -0.0179882 0.0259055 -0.0455358 0.0703333 -0.0334934 0.003671 -0.4685033 0.1384436 -0.0184967 0.1391563 -0.1689696 -0.0171037 -0.0143235 -0.0376153 -0.271975 0.544097 -0.6267576 0.1132921 -0.832398 0.7965921 -0.0814321 0.1518755 -0.087666 0.135384 -0.0534349 -0.4337462 0.0677194 -0.7232416 0.571071 -0.1031691 0.1425693 -0.1199023 -0.1591065 0.9787162 0.1072732 -0.133359 0.5700759 -0.1505447 -0.0235708 -0.2505652 0.0222873 -0.0097895 0.1534092 -0.065601 0.0002457 -0.0368455 -0.1112156 0.010986 -0.0146409 0.0168402 -0.0580736 -0.0723914 0.0626095 -0.1103806 -0.0429241 -0.0637764 0.0675729 -0.062401 0.0523973 -0.0819483 0.0312495 -0.1068759 0.0125472 -0.1476774 -0.1043343 0.0333361 0.0013283 0.0486699 0.0727477 -0.0748528 0.0618406 0.1097015 0.0748556 0.0928553 -0.0256876 0.1049897 -0.007409 0.0313187 0.0213798 0.037194 -0.0962218 0.0982048 0.0411682 0.0798627 -0.0712042 0.029642 0.0016334 -0.0154014 -0.0842372 0.0383285 -0.1305714 -0.0853849 0.055982 0.0393056 0.0336497 0.0954114 0.0940494 -0.0082402 -0.0270896 0.0275642 0.0362528 -0.1228392 -0.0091657 -0.1032323 -0.0714606 0.0380716 0.0425572 -0.0416252 0.0957118 0.0512242 0.0598231 -0.0983633 0.08529 -0.0177835 0.0995987 -0.0482469 0.0222259 -0.0895765 -0.0318816 0.0471783 0.0363952 0.0521634 0.1520505 0.0939683 -0.032461 0.0160492 -0.0401771 0.0316784 0.0393513 0.0193144 0.0384048 0.1678996 0.2496932 -0.0826197 0.0308772 -0.0211433 0.0949513 0.0647238 0.0116838 0.0723388 0.3309944 0.2917862 -0.2328445 0.1763243 -0.0464052 0.1395591 -0.0468814 0.0805688 0.0030059 0.0680649 0.2475687 -0.298304 -0.0824721 -0.0851174 0.1612145 0.0254363 -0.0895388 0.019531 0.0905601 unknown
polarizability: 163.227614|-11.4608291|150.9714488|-6.1501655|-14.9886225|75.5540004 unknown
InChI: InChI=1S/C9H12ClFN2O/c1-5(2)14-9-4-8(13-12)7(11)3-6(9)10/h3-5,13H,12H2,1-2H3
charge 0 multiplicity 1
26 atoms
Cl 1.164438 -3.146989 0.492376
F  -3.565274 -0.940289 0.492439
O  1.974114 -0.400726 -0.272232
N  -2.59548 1.549287 -0.20576
N  -2.235441 2.851803 -0.567824
C  2.63294 0.904642 -0.567052
C  0.59341 -0.457359 -0.078476
C  2.752943 1.741316 0.719269
C  3.991985 0.524551 -1.162943
C  -0.289688 0.642867 -0.241256
C  -1.689239 0.493637 -0.055003
C  0.059721 -1.723475 0.281227
C  -2.165183 -0.793676 0.302588
C  -1.324528 -1.894465 0.472605
H  2.029668 1.438788 -1.330916
H  3.228724 2.714285 0.497575
H  1.768651 1.933177 1.179894
H  3.378445 1.207495 1.45579
H  4.564082 1.434187 -1.41979
H  3.861202 -0.082625 -2.074301
H  4.574649 -0.065818 -0.434813
H  0.093991 1.627814 -0.517403
H  -1.741097 -2.866457 0.748473
H  -3.588681 1.37424 -0.060731
H  -1.888302 2.954533 -1.527085
H  -1.709349 3.369358 0.143746
