program: Gaussian 09
title: 000187487
version: EM64L-G09RevD.01
frameworkgroup: C1[X(C9H8O6S)]
method: RPBEPBE
basis: SDD
operation: Freq
keyword: #pfreq=noraman
keyword: PBEPBE/SDD
title: #p freq=noraman PBEPBE/SDD
converged: YES YES NO NO
title: Mulliken charges:
elementType: S O O O O O O C C C C C C C C C H H H H H H H H
charge: 1.136380 -0.423577 -0.548781 -0.445714 -0.459216 -0.424754 -0.247152 0.526103 0.305586 -0.459470 -0.385762 -0.339260 -0.189720 -0.250659 -0.295878 0.159482 0.264339 0.249260 0.270595 0.245904 0.265635 0.256933 0.406580 0.383146
chargesum: 0.00000
title: Mulliken charges with hydrogens summed into heavy atoms:
elementType: S O O O O O O C C C C C C C C C
charge: 1.136380 -0.423577 -0.142201 -0.445714 -0.459216 -0.041607 -0.247152 0.526103 0.305586 -0.195131 -0.136502 -0.068665 0.056183 0.014976 -0.038945 0.159482
polarizability: 2.85782789e+02 1.56568981e+01 1.95899977e+02 4.73406532e-01 -5.92287850e+00 8.55603646e+01
1716.lowfreq: -3.2278 0.0009 0.0020 0.0024 2.6525 8.2249 17.8291 25.4721 37.0423
frequency: 17.8172 25.3226 37.0294 60.1523 77.3886 86.2332 123.3405 148.0686 155.4916 173.0519 205.2549 257.8287 277.3372 293.4883 304.2529 317.3795 332.3470 394.8676 421.1033 449.9542 512.1830 518.2063 538.5870 560.3165 581.3380 621.7588 627.6935 672.0860 701.4518 763.1479 810.9731 855.3791 885.9553 910.0211 926.9198 933.8502 967.6002 971.7357 983.6878 993.5678 1014.6905 1054.5665 1084.4801 1101.3359 1148.1459 1179.8777 1216.4628 1241.3405 1286.6493 1319.6305 1341.5668 1386.0968 1417.1788 1463.6315 1559.7694 1584.4453 1629.4054 1655.9536 3105.8266 3138.4302 3158.6750 3163.2340 3168.4130 3179.1680 3446.6783 3524.7602
redmass: 10.8213 10.6693 8.6832 7.1063 7.9411 5.9604 6.5490 3.2984 4.1987 7.0043 5.4034 2.7022 2.8297 3.0903 6.5204 4.7290 6.7362 8.8622 6.6678 3.0570 4.4697 7.1334 6.3848 4.5837 2.2080 3.0458 3.4344 1.9619 3.7585 6.5207 1.4882 11.1865 1.7399 1.9005 5.5002 1.4417 7.7421 3.2991 6.1593 1.3384 1.2121 2.2040 1.6203 1.1868 2.1887 1.2307 1.4791 1.9281 1.4625 1.4190 2.3815 7.4238 2.7444 2.5611 5.3235 5.7816 8.6598 5.7349 1.0903 1.0888 1.0919 1.0930 1.0917 1.0990 1.0653 1.0641
irintensity: 0.4214 0.8646 2.0608 5.8291 1.8320 1.2167 8.5362 7.1246 11.4832 6.6806 24.3121 59.1423 2.3430 11.9949 9.2351 28.2385 25.4671 44.3154 10.0548 4.2786 34.4616 81.9073 48.9552 101.0816 60.2526 41.8882 45.9154 44.5256 12.9899 4.7147 40.1447 99.0657 17.9722 5.3367 9.7746 6.2126 43.2981 39.8699 4.5589 3.6907 46.3359 450.6502 20.7445 158.9594 36.2633 0.6205 24.8298 7.4872 4.0975 6.4422 110.4964 1.1512 16.7711 17.5664 32.2312 43.7481 387.0768 82.3050 1.5988 3.4061 9.3824 6.1144 2.2234 7.9489 92.4567 61.2416
temp: 298.150 k
press: 1.00000 atm
elementType: 16 8 8 8 8 8 8 6 6 6 6 6 6 6 6 6 1 1 1 1 1 1 1 1
symmnumber: 1
zpe: 413097.9 jmol-1
zpe.correction: 0.157341 hartree
zpe.thermalcorrener: 0.174076 hartree
zpe.thermalcorrenthalpy: 0.175020 hartree
zpe.thermalcorrgfe: 0.109744 hartree
zpe.sumelectzpe: -1195.789135 hartree
zpe.sumelectthermal: -1195.772400 hartree
zpe.sumelectthermalent: -1195.771455 hartree
zpe.sumelectthermalfe: -1195.836731 hartree
dipole: 2.1761 3.2632 2.2068
dipole: 4.5004
quadrupole: -120.6932 -88.6762 -101.3841
quadrupole: -12.0446 -5.1259 -4.7368
quadrupole: -17.1087 14.9083 2.2004 -12.0446 -5.1259 -4.7368
hfenergy: -1195.9464754 hartree
pointgroup: C01 [X(C9H8O6S1)]
dipole: 0.7370105 -1.2732604 -0.9852211 debye
dipolederiv: 1.461942 -0.0894394 0.0620365 -0.5466952 1.4930488 0.0339374 0.0222726 -0.0757285 1.5512746 0.1799581 -0.450157 -0.19203 -0.4800782 0.046734 0.1582808 -0.2565073 0.1225399 -0.3474052 -0.6901698 0.0986541 -0.1236748 0.3371699 -0.736388 0.1411651 -0.5927653 0.5293568 -0.694543 -0.8438164 0.189336 0.1511243 0.0954148 -0.4420425 -0.0135109 0.4272265 -0.2289934 -0.5437044 -0.3554625 -0.1597774 -0.1004065 0.2875172 -0.6884938 -0.1447164 0.2440161 -0.2276511 -0.5168777 -0.5323048 -0.3524672 0.0728752 -0.5931275 -1.2743875 0.1170081 0.0770416 0.0942378 -0.4376962 -1.2504609 0.1002377 -0.0664846 0.169028 -0.6584162 0.0693562 -0.1234605 0.0605418 -0.3461396 -0.0938876 0.1010804 -0.0024373 0.4015086 -0.3258263 -0.0310343 -0.1073655 0.1038873 0.0547538 -0.1270587 0.2347171 0.1190914 0.1434194 -0.0925791 -0.0993055 -0.1735425 0.1156259 0.1012657 0.2091782 -0.313824 -0.0676106 -0.0392877 -0.0547506 -0.0665693 0.0489624 -0.0166497 -0.0803001 0.0593276 -0.068973 0.0516543 0.0010441 0.1086527 -0.0419185 0.0342769 -0.0593178 -0.1144314 -0.0378548 0.0355453 0.056002 -0.3423562 0.1523687 0.0626401 0.1481682 -0.1066462 -0.1174878 -0.4698716 0.1897713 0.0429412 0.0685884 0.2363452 -0.0431443 -0.0894934 -0.0064375 -0.1008336 0.6235752 0.1194236 0.001994 0.3392449 0.2293636 -0.043104 0.0132512 -0.0377792 -0.0787467 -0.9366281 -0.3925701 0.0447767 -0.7232558 -0.2746356 -0.0123002 0.0315239 -0.0119182 -0.1471033 2.2242416 0.4849758 0.0284741 0.4842196 1.5456997 -0.1950562 0.1449707 -0.1443867 0.2728936 0.0922959 -0.0101474 -0.0024821 -0.0219552 -0.0054317 0.0290832 0.0108233 -0.0055468 0.1226525 -0.0173704 0.0942868 -0.0319563 0.064214 0.0556803 0.0237704 -0.0139965 0.0139411 0.1418633 -0.0013127 -0.0441414 -0.0129489 -0.0146539 0.0949674 0.0130642 0.0087769 -0.0082544 0.1484771 0.0759977 -0.0262368 -0.0003147 -0.023742 -0.0927167 0.0299694 -0.0185578 0.0488839 0.1534163 0.0379101 0.0325287 -0.0156733 0.0794584 0.0227254 0.0266185 -0.029712 0.023289 0.1461727 0.0017112 0.0582427 -0.0279472 0.1086257 0.0497988 0.0209607 -0.0360227 0.0174903 0.1605623 0.2405355 0.1196078 0.0515119 0.0714972 0.2528917 -0.0480212 0.2773053 -0.2094064 0.2774896 0.1495253 0.0493264 -0.0385156 0.1342013 0.3573917 0.0128266 -0.047192 0.0089221 0.3944476 unknown
polarizability: 283.1237178|-20.2867891|198.1663292|-11.879397|1.9814037|85.9530845 unknown
InChI: InChI=1S/C9H7O3.HO3S/c10-8-3-1-2-7(6-8)4-5-9(11)12;1-4(2)3/h1-6,11H;1H
charge 0 multiplicity 1
24 atoms
S  -3.354486 1.332118 0.634273
O  -2.569096 0.080622 -0.800235
O  -4.129716 2.259603 -0.729524
O  -4.529828 0.74024 1.555359
O  -2.156546 2.1776 1.303417
O  4.411665 2.355703 -0.221324
O  5.104255 0.166569 0.177588
C  0.892848 -1.06629 -0.085852
C  -1.519478 -0.735253 -0.437551
C  -0.200429 -0.20951 -0.373614
C  0.626875 -2.452035 0.137902
C  -1.772863 -2.117874 -0.182882
C  -0.688174 -2.970545 0.088604
C  2.28485 -0.598649 -0.008139
C  2.731531 0.684701 -0.151642
C  4.17441 0.982677 -0.042115
H  -0.058221 0.86053 -0.553919
H  1.46539 -3.122664 0.359952
H  -2.803855 -2.482758 -0.223206
H  -0.860723 -4.036342 0.267464
H  3.049045 -1.364273 0.190529
H  2.073401 1.53777 -0.341656
H  -3.703406 1.888526 -1.559634
H  5.387852 2.531437 -0.139195
