program: Gaussian 09
title: 000187501
version: EM64L-G09RevD.01
frameworkgroup: C1[X(C20H14O2)]
method: RPBEPBE
basis: SDD
operation: Freq
keyword: #pfreq=noraman
keyword: PBEPBE/SDD
title: #p freq=noraman PBEPBE/SDD
converged: YES YES NO NO
title: Mulliken charges:
elementType: O O C C C C C C C C C C C C C C C C C C C C H H H H H H H H H H H H H H
charge: -0.301081 -0.301081 -0.230890 -0.230893 0.020813 0.020812 0.499214 0.499228 -0.359271 -0.359272 0.476336 0.476337 0.477909 0.477908 -0.680057 -0.680061 -0.619931 -0.619934 -0.491041 -0.491040 -0.490987 -0.490989 0.236650 0.236650 0.231342 0.227799 0.231341 0.227799 0.245333 0.245333 0.276851 0.276849 0.238412 0.238412 0.242599 0.242600
chargesum: 0.00000
title: Mulliken charges with hydrogens summed into heavy atoms:
elementType: O O C C C C C C C C C C C C C C C C C C C C
charge: -0.301081 -0.301081 0.005760 0.005757 0.020813 0.020812 0.499214 0.499228 0.099870 0.099868 0.476336 0.476337 0.477909 0.477908 -0.434724 -0.434728 -0.343080 -0.343085 -0.252629 -0.252629 -0.248389 -0.248390
polarizability: 4.17673126e+02 4.29402397e-04 2.27986096e+02 4.80464276e+00 1.79656254e-04 1.04949132e+02
1716.lowfreq: -7.8699 -0.0009 -0.0008 -0.0007 0.9939 10.9723 32.4862 44.6034 63.3377
frequency: 32.4068 44.5984 63.3173 97.2435 107.9066 147.8782 158.0316 160.9690 222.4401 225.8108 250.2114 272.1367 330.4130 358.5252 375.1499 398.6625 444.0452 463.4159 485.2288 492.3470 497.9727 509.6426 539.5782 556.6176 578.4995 585.9072 610.8854 648.5735 674.2389 695.2932 725.3861 738.4155 743.4592 781.3894 789.3436 803.8593 805.9636 819.8792 830.4534 837.0352 889.8758 903.9033 908.4266 918.7151 921.2707 936.6067 983.2588 984.8667 987.5549 989.0550 1004.9029 1011.1113 1020.0206 1020.5455 1096.5837 1097.7078 1105.0416 1106.2715 1127.0362 1132.0021 1167.7529 1173.7457 1182.1322 1214.2086 1223.1978 1224.5223 1243.2089 1279.2347 1288.5009 1335.9415 1349.0203 1366.5618 1382.8571 1389.0167 1413.2926 1436.5444 1442.1940 1450.8783 1469.7631 1471.9679 1472.9772 1485.4490 1485.8667 1581.9805 1596.1480 1603.1233 1620.5472 1640.1876 3058.4809 3058.5217 3089.2955 3089.4058 3115.2873 3116.2363 3119.2671 3122.4914 3138.1257 3138.1769 3143.5656 3147.2230 3168.9598 3169.0301
redmass: 6.6346 4.2533 3.4947 4.5309 5.4606 5.2393 4.2194 4.3470 4.2109 6.3727 3.5168 5.5076 6.0731 5.0093 4.5471 3.5046 4.1930 7.4597 4.7334 6.6049 4.4180 3.9851 3.0036 6.9216 5.9892 4.0575 3.3542 3.2652 3.2630 3.7341 8.0856 2.4893 7.6416 4.4262 4.9551 4.8714 3.8325 1.5038 1.4062 3.1999 1.8290 1.9260 1.7416 1.7830 1.8978 1.7304 1.6588 2.2290 7.4685 1.5024 2.4139 1.9762 1.1835 1.1996 1.3802 1.3355 1.3076 1.3052 2.7865 1.6044 1.5236 1.3445 1.2908 1.5477 1.8066 1.8931 1.4185 1.5531 2.1754 2.9759 2.1181 4.4769 1.7557 5.4114 2.3181 7.4942 7.7729 4.2390 1.2821 1.1877 3.1900 3.1725 7.2653 4.7284 8.2596 6.5907 6.1118 7.5584 1.0521 1.0521 1.0905 1.0905 1.0907 1.0913 1.0867 1.0864 1.0913 1.0917 1.0981 1.0979 1.1196 1.1196
irintensity: 0.3210 4.2900 7.3818 0.2188 1.2717 5.5448 0.0022 12.1602 9.0140 0.0864 0.6753 0.1017 2.9458 0.3015 10.3155 0.0662 0.8696 0.6504 7.3440 0.4704 0.7408 0.0102 0.2701 1.5842 1.9788 19.1530 0.8282 1.3118 0.7102 0.0001 20.3198 38.5417 9.8535 14.7879 4.5609 19.7588 26.0607 16.7045 8.0776 0.5017 0.0295 77.5117 0.4065 14.7361 1.2244 59.4689 0.0102 0.0038 4.3202 0.0153 0.2267 21.9279 6.5485 0.0646 13.7992 3.7409 0.7739 4.3609 0.1068 2.0427 18.7265 0.0010 23.5067 1.0317 5.8692 0.5155 4.9290 8.5266 3.2681 0.4774 17.9719 0.3182 6.5885 6.3118 3.8748 0.2553 0.0009 10.3993 1.4573 5.5950 0.0909 0.6924 0.0270 0.3989 0.4393 2.0627 47.7058 0.0685 68.4859 1.6289 31.2702 15.8411 9.8716 14.4324 6.8414 0.8743 0.2533 0.7007 38.7438 20.2359 70.2820 10.0220
temp: 298.150 k
press: 1.00000 atm
elementType: 8 8 6 6 6 6 6 6 6 6 6 6 6 6 6 6 6 6 6 6 6 6 1 1 1 1 1 1 1 1 1 1 1 1 1 1
symmnumber: 1
zpe: 728004.1 jmol-1
zpe.correction: 0.277282 hartree
zpe.thermalcorrener: 0.293877 hartree
zpe.thermalcorrenthalpy: 0.294821 hartree
zpe.thermalcorrgfe: 0.232583 hartree
zpe.sumelectzpe: -919.440600 hartree
zpe.sumelectthermal: -919.424005 hartree
zpe.sumelectthermalent: -919.423061 hartree
zpe.sumelectthermalfe: -919.485300 hartree
dipole: 0.0000 2.7582 -0.0001
dipole: 2.7582
quadrupole: -121.1270 -113.7684 -132.2745
quadrupole: 0.0005 20.6661 0.0001
quadrupole: 1.2630 8.6216 -9.8845 0.0005 20.6661 0.0001
hfenergy: -919.7178823 hartree
pointgroup: C01 [X(C20H14O2)]
dipole: -0.0000167 -1.0851754 -0.0000618 debye
polarizability: 417.3831041|-0.0017524|227.9860956|10.6628982|0.0039616|105.2391539 unknown
InChI: InChI=1S/C20H14O2/c1-2-12-6-16(18-10-22-18)8-14-4-3-13-7-15(17-9-21-17)5-11(1)19(13)20(12)14/h1-8,17-18H,9-10H2
charge 0 multiplicity 1
36 atoms
O  -5.721726 0.966005 -0.881184
O  5.721771 0.965805 0.88121
C  -5.048909 -0.306502 -0.410481
C  5.048932 -0.306637 0.410357
C  -0.714781 -0.290485 -0.062391
C  0.714804 -0.290505 0.062261
C  -3.556885 -0.288516 -0.312053
C  3.556909 -0.288612 0.311927
C  -5.919646 0.484393 0.530488
C  5.919691 0.484349 -0.530514
C  -1.43625 -1.53749 -0.130758
C  1.436247 -1.53753 0.130546
C  -1.437837 0.956916 -0.128448
C  1.437887 0.956877 0.128402
C  -2.8493 -1.512389 -0.260357
C  2.849298 -1.512466 0.260149
C  -2.849621 0.935777 -0.254053
C  2.849671 0.9357 0.254007
C  -0.688711 -2.775957 -0.064772
C  0.688682 -2.775976 0.064478
C  -0.688464 2.195447 -0.063892
C  0.688541 2.195429 0.063928
H  -5.486173 -1.213259 -0.8503
H  5.486176 -1.213452 0.850076
H  -5.433927 1.098285 1.299672
H  -6.931604 0.129099 0.76218
H  5.43399 1.09834 -1.299633
H  6.931643 0.129061 -0.76224
H  -3.396872 -2.462026 -0.317101
H  3.39685 -2.462119 0.31683
H  -3.409631 1.874261 -0.339139
H  3.409698 1.874168 0.339158
H  -1.240462 -3.722025 -0.117279
H  1.240413 -3.72206 0.116922
H  -1.241159 3.140664 -0.116649
H  1.241256 3.140629 0.116749
