program: Gaussian 09
title: 000015823
version: EM64L-G09RevD.01
frameworkgroup: C1[X(C10H9ClN4)]
method: RPBEPBE
basis: SDD
operation: Freq
keyword: #p
keyword: freq=noraman
keyword: PBEPBE/SDD
title: #p freq=noraman PBEPBE/SDD
converged: NO YES NO NO
title: Mulliken charges:
elementType: Cl N N N N C C C C C C C C C C H H H H H H H H H
charge: -0.054190 -0.067086 -0.093070 -0.063383 -0.573168 0.284214 0.013911 -0.347992 -0.347022 0.154519 -0.230905 -0.229663 -0.003155 -0.225305 -0.703515 0.280408 0.271847 0.230831 0.229186 0.230975 0.280405 0.281436 0.338593 0.342128
chargesum: 0.00000
title: Mulliken charges with hydrogens summed into heavy atoms:
elementType: Cl N N N N C C C C C C C C C C
charge: -0.054190 -0.067086 -0.093070 -0.063383 0.107553 0.284214 0.013911 -0.067584 -0.075174 0.154519 -0.000074 -0.000477 -0.003155 0.005670 -0.141674
polarizability: 2.19798508e+02 -1.61496514e+01 1.66648099e+02 -4.95013330e+00 -7.63166859e+00 7.39357877e+01
1716.lowfreq: -4.2705 -0.0017 0.0008 0.0015 2.1649 9.5718 32.5967 38.7477 78.1380
frequency: 32.5730 38.6405 78.1338 99.8076 125.5308 182.4126 216.4157 247.1311 262.0679 326.4769 345.5577 404.4701 457.1126 508.4415 529.5002 553.3538 562.2707 573.5501 615.3487 621.4438 670.2121 689.5132 708.3041 738.8122 792.1969 838.8514 854.9358 866.5886 909.0474 920.0569 959.7076 988.7092 991.5592 1000.8162 1010.9428 1021.7341 1039.6108 1077.9347 1126.7447 1151.6061 1172.5124 1180.3517 1229.7157 1266.3966 1306.2781 1344.9286 1370.9228 1392.4161 1425.0812 1438.9671 1461.4066 1467.3802 1492.3983 1519.9477 1588.7339 1610.6081 1619.2031 3088.3528 3128.2493 3141.4093 3156.0740 3168.9088 3175.2089 3183.2880 3549.0267 3707.6767
redmass: 8.8530 4.1258 6.6468 8.7682 4.2268 7.8876 6.5795 7.4930 2.9632 4.2141 3.9949 2.8553 3.6463 3.5419 1.2922 4.4561 1.0931 7.4579 6.7605 8.2957 6.2569 4.2936 1.7277 7.6156 2.5638 6.3028 3.8290 1.2451 11.2860 2.1561 1.4368 4.4634 4.6561 1.3767 1.3325 2.3340 2.1962 1.5374 1.6127 2.0744 1.0577 1.1954 3.9269 1.1745 1.4604 3.8146 4.5008 9.1193 1.5158 1.8793 3.1126 6.1890 3.4868 2.8818 6.3896 3.1954 2.3579 1.0560 1.0854 1.0895 1.0944 1.0949 1.0990 1.1128 1.0445 1.1058
irintensity: 1.0020 0.1413 3.4454 1.4484 1.0340 4.1659 0.2229 1.8899 6.7197 1.7498 2.6294 0.0235 1.1564 7.0176 282.2300 16.7031 3.3194 4.8474 5.5185 37.9663 7.3797 5.3336 62.3032 42.3110 41.1355 2.1728 2.3699 0.0188 8.8886 0.7902 4.3877 0.1085 2.5957 0.0349 0.6726 11.4984 2.9914 13.4497 11.9036 3.0337 0.1151 37.1797 17.0239 6.5162 0.4346 8.5506 199.0673 12.9172 4.7090 8.8800 71.8311 468.5924 180.3519 346.9533 0.2170 206.6202 309.9007 11.6270 0.1025 15.6097 22.9397 9.7662 19.9743 1.7708 132.3057 51.8879
temp: 298.150 k
press: 1.00000 atm
elementType: 17 7 7 7 7 6 6 6 6 6 6 6 6 6 6 1 1 1 1 1 1 1 1 1
symmnumber: 1
zpe: 468479.0 jmol-1
zpe.correction: 0.178434 hartree
zpe.thermalcorrener: 0.191161 hartree
zpe.thermalcorrenthalpy: 0.192106 hartree
zpe.thermalcorrgfe: 0.137327 hartree
zpe.sumelectzpe: -1064.496085 hartree
zpe.sumelectthermal: -1064.483358 hartree
zpe.sumelectthermalent: -1064.482414 hartree
zpe.sumelectthermalfe: -1064.537193 hartree
dipole: 1.4874 3.1266 1.0655
dipole: 3.6226
quadrupole: -87.3252 -77.0754 -95.9799
quadrupole: -9.3682 -5.7813 -5.5110
quadrupole: -0.5317 9.7181 -9.1864 -9.3682 -5.7813 -5.5110
hfenergy: -1064.6745194 hartree
pointgroup: C01 [X(C10H9Cl1N4)]
dipole: -0.4009298 -1.2405141 0.5759218 debye
dipolederiv: -0.2999587 -0.1414327 0.0656509 -0.1850097 -0.3216309 0.0902714 0.1948154 0.1967862 -0.3696645 -1.6302924 -0.1118033 -0.0078005 -0.3985432 -0.6242812 -0.0360283 -0.1342441 -0.0589555 -0.1389886 -1.2678012 0.6434008 0.0172727 0.4920778 -0.888433 -0.0160768 -0.0076438 -0.0306451 -0.2131438 -0.6779805 -0.2081675 -0.0271368 0.3211924 -1.2030251 0.0015058 0.0090072 -0.1035598 -0.1957536 -0.4451279 0.4740299 0.0532956 0.6497909 -1.3824435 0.0105393 0.0654352 -0.0260901 -0.6801125 -0.7000205 0.1148224 -0.0137188 0.091292 -0.0452537 0.0060455 -0.0296559 0.0069495 -0.0352718 2.0269802 -0.2520823 0.026805 -0.1178767 0.758576 0.0403309 0.0970809 0.0507245 0.1204501 0.0823225 0.0899543 0.0177666 -0.1933222 0.001764 0.0029722 -0.0124208 0.0109117 -0.1094344 0.1196218 -0.1288834 0.0001681 0.1581003 -0.0200605 0.0101295 0.0303021 0.0020371 -0.1176507 1.2085692 0.0702367 -0.0421645 -0.0734809 0.8759888 -0.0490719 -0.0448028 -0.0163261 -0.0282763 -0.2058041 -0.1231833 -0.0106699 -0.1978738 0.126974 0.0156353 -0.0172075 0.0143527 -0.1566876 -0.1099875 0.1902215 0.0218795 0.2822599 -0.0070471 0.0224469 0.0255245 0.0231271 -0.1565464 0.9875426 -0.5977529 -0.0125678 -0.7859043 1.876604 0.054128 -0.0407755 0.1233936 0.2585289 0.1001333 -0.0136399 0.0143259 -0.0378365 0.0328211 0.0132814 0.0107974 0.0128538 -0.13851 0.2409584 0.0522266 -0.0833649 0.093259 0.2340498 -0.1201443 -0.1333583 -0.1511375 0.4591583 0.1179738 -0.0856679 -0.0117694 -0.0783887 0.0420106 -0.0098625 -0.005464 -0.0123229 0.14662 0.145988 0.0553713 0.0006576 0.0386528 -0.0141553 -0.0117287 0.0016473 -0.0105848 0.1491316 0.0371062 0.0650706 0.0002788 0.0977844 -0.0944875 -0.016382 0.0020725 -0.0160699 0.1559177 -0.0280852 -0.0898526 -0.015778 -0.1216556 -0.0340472 -0.0212371 -0.0203298 -0.020218 0.1552997 -0.1372965 0.0386118 -0.0112396 0.0381776 0.0887511 -0.0036156 -0.0128446 -0.0033799 0.1565895 -0.0282654 -0.022591 -0.0398141 0.0439421 0.0656256 0.0772354 -0.0195224 0.0540981 -0.0050636 0.0682596 0.0593726 0.08359 -0.0113764 0.0007869 -0.0211454 0.0645202 -0.0084668 -0.0115207 0.1509662 0.0121436 -0.0143948 -0.0480776 0.2950685 -0.0165225 -0.0166587 -0.0115894 0.3770248 0.2441981 -0.0904052 -0.0112714 -0.0571838 0.2358446 -0.0227069 -0.0062747 -0.0258886 0.3779038 unknown
polarizability: 223.1433317|-8.5546218|164.1599209|-1.4954086|-1.3721703|73.0791414 unknown
InChI: InChI=1S/C10H9ClN4/c11-6-8-13-9(15-10(12)14-8)7-4-2-1-3-5-7/h1-5H,6,12H2
charge 0 multiplicity 1
24 atoms
Cl 3.584228 2.391869 -1.2606
N  0.84169 0.843826 0.254338
N  0.460872 -1.535793 -0.018571
N  2.736981 -0.676133 0.220623
N  2.317727 -2.967655 -0.042578
C  -1.44881 -0.00544 0.030577
C  0.011929 -0.247473 0.089729
C  -1.953747 1.320347 0.11027
C  -2.352087 -1.093491 -0.107513
C  2.178027 0.564382 0.303283
C  -3.343104 1.552161 0.053932
C  -3.740364 -0.857074 -0.162922
C  1.822658 -1.697721 0.05545
C  -4.240194 0.465499 -0.082079
C  3.119009 1.725779 0.456043
H  -1.24084 2.143769 0.211903
H  -1.944932 -2.106948 -0.169778
H  -3.728248 2.575851 0.114364
H  -4.433852 -1.698452 -0.269354
H  -5.320049 0.64733 -0.125988
H  4.067889 1.420421 0.913936
H  2.639716 2.567319 0.97125
H  1.673901 -3.744465 -0.171393
H  3.324401 -3.110508 -0.008222
