program: Gaussian 09
title: 000185076
version: EM64L-G09RevD.01
frameworkgroup: C1[X(C12H13N5)]
method: RPBEPBE
basis: SDD
operation: Freq
keyword: #pfreq=noraman
keyword: PBEPBE/SDD
title: #p freq=noraman PBEPBE/SDD
converged: YES YES NO NO
title: Mulliken charges:
elementType: N N N N N C C C C C C C C C C C C H H H H H H H H H H H H H
charge: -0.460127 -0.451655 -0.158867 -0.037699 0.002128 0.332508 -0.389914 0.266238 0.143611 -0.457320 -0.008816 -0.328537 0.030924 -0.366790 -0.854593 -0.300584 -0.298762 0.222075 0.233376 0.230676 0.227219 0.283984 0.327325 0.336137 0.256962 0.304754 0.219201 0.220809 0.236852 0.238888
chargesum: 0.00000
title: Mulliken charges with hydrogens summed into heavy atoms:
elementType: N N N N N C C C C C C C C C C C C
charge: -0.132802 -0.167671 -0.158867 -0.037699 0.002128 0.332508 0.065536 0.266238 0.143611 0.000575 -0.008816 0.007600 0.030924 -0.109828 -0.109829 -0.063732 -0.059874
polarizability: 3.04594820e+02 -2.28307724e+00 1.63044017e+02 -6.66370015e-01 7.47453726e-01 7.75272909e+01
1716.lowfreq: -11.4128 -0.0006 -0.0002 0.0004 3.0232 3.8167 43.5680 50.2050 103.9687
frequency: 43.5640 50.0579 103.9585 107.3876 116.2530 125.2687 192.0163 225.5752 237.1892 251.9738 272.6419 305.8474 318.9908 351.8741 432.2959 453.4168 495.2854 511.7533 537.1780 558.8509 562.3959 571.5547 641.4125 667.5512 685.4203 728.0697 761.3935 766.5326 807.2650 834.9404 846.3565 874.1360 877.6990 890.5569 908.8209 943.2330 945.6635 1015.5863 1016.9519 1021.7131 1038.0680 1040.6058 1054.4036 1084.8785 1099.6077 1168.6431 1174.7484 1200.7374 1210.6022 1224.3866 1236.9651 1276.1335 1293.9779 1307.4276 1312.4562 1356.8126 1375.9952 1384.5269 1401.3191 1426.3214 1440.0051 1459.1016 1478.2743 1486.5100 1496.2205 1502.1040 1513.9044 1531.0376 1576.8002 1614.2418 1634.1869 2948.7332 2973.1335 2999.6994 3016.9520 3039.7659 3061.5362 3100.8942 3119.5188 3144.3378 3145.8844 3167.5883 3546.2235 3554.4238
redmass: 4.7324 3.9741 2.6946 2.6905 3.8637 4.2180 1.0729 3.4631 5.6507 3.8224 4.6029 3.3418 2.2679 1.8729 5.6653 5.1459 4.2070 1.5190 4.7756 5.5316 2.6872 5.8291 7.4109 6.9114 3.9675 4.8484 5.6892 4.8144 3.8918 1.3474 1.3857 3.9783 1.4578 4.5506 3.1025 1.4786 3.6926 1.5342 2.5729 2.8478 3.1017 1.5048 3.0112 1.6677 2.5089 1.5826 1.1555 2.2029 1.2131 1.9916 2.2392 1.4448 2.7952 1.8733 1.5913 2.2445 2.1233 1.3863 1.6718 2.8227 2.4154 1.9777 1.0974 2.1794 1.0539 1.1995 3.6978 4.1475 3.2972 6.2953 4.9143 1.0401 1.0638 1.0635 1.0978 1.0992 1.1056 1.0937 1.0879 1.0920 1.0969 1.0961 1.0785 1.0751
irintensity: 2.2144 5.4874 1.3325 4.0492 1.1684 0.1745 1.9959 7.0334 0.7956 7.1013 0.6349 1.3642 25.0424 101.8899 8.8015 12.8269 17.3757 92.9151 1.5833 4.4029 18.8664 1.6683 13.3228 1.6268 0.2876 9.8843 1.9293 0.4628 5.4749 1.8782 1.6956 8.1994 75.2511 10.5898 2.1465 0.0378 9.5788 4.1958 9.1021 29.8077 13.8933 1.8728 84.1563 4.2823 2.5257 3.7390 6.4872 14.5062 4.8949 19.4321 8.2663 66.8202 36.2438 7.1984 119.5700 6.9861 48.1514 33.3593 25.6555 7.3810 91.8647 96.7102 11.0464 162.1115 19.9716 34.3241 106.6862 367.5571 64.0374 521.7376 126.4447 40.1678 80.5452 86.1053 25.3764 34.2162 59.0953 1.6981 7.1832 58.2296 37.8399 8.4047 7.3000 29.1105
temp: 298.150 k
press: 1.00000 atm
elementType: 7 7 7 7 7 6 6 6 6 6 6 6 6 6 6 6 6 1 1 1 1 1 1 1 1 1 1 1 1 1
symmnumber: 1
zpe: 623722.9 jmol-1
zpe.correction: 0.237564 hartree
zpe.thermalcorrener: 0.252026 hartree
zpe.thermalcorrenthalpy: 0.252970 hartree
zpe.thermalcorrgfe: 0.195777 hartree
zpe.sumelectzpe: -737.613298 hartree
zpe.sumelectthermal: -737.598835 hartree
zpe.sumelectthermalent: -737.597891 hartree
zpe.sumelectthermalfe: -737.655085 hartree
dipole: 4.0392 3.4932 0.8915
dipole: 5.4141
quadrupole: -77.3227 -98.8703 -102.4743
quadrupole: 3.6966 3.7443 1.2324
quadrupole: 15.5664 -5.9812 -9.5852 3.6966 3.7443 1.2324
hfenergy: -737.8508613 hartree
pointgroup: C01 [X(C12H13N5)]
dipole: -1.6053003 -1.350091 0.3707324 debye
polarizability: 304.5085115|-3.5647095|163.0066541|2.7612128|-2.9435808|77.6509625 unknown
InChI: InChI=1S/C12H13N5/c1-8-9(17-12-15-6-7-16-12)2-3-10-11(8)14-5-4-13-10/h2-5,15,17H,6-7H2,1H3
charge 0 multiplicity 1
30 atoms
N  -1.651426 -0.800191 -0.074034
N  -4.032282 -1.02601 -0.02039
N  -3.148383 1.113071 -0.197076
N  3.180387 -1.315978 0.019834
N  3.477735 1.54895 0.003359
C  -0.36811 -0.208948 -0.059945
C  -5.240816 -0.170066 0.091413
C  -2.901064 -0.177499 -0.088679
C  0.753619 -1.074917 -0.030671
C  -4.638484 1.258967 -0.195786
C  2.05949 -0.486882 -0.010164
C  -0.211476 1.221564 -0.072798
C  2.221443 0.959485 -0.017405
C  1.059341 1.786915 -0.048962
C  0.597147 -2.583155 -0.017138
C  4.384079 -0.71286 0.039909
C  4.536482 0.71315 0.03142
H  -5.685342 -0.233181 1.104817
H  -6.007984 -0.456847 -0.648211
H  -4.962458 1.635226 -1.183982
H  -4.945875 2.000231 0.56264
H  -3.999116 -1.93235 0.449622
H  -1.66421 -1.818686 -0.137686
H  -1.117798 1.832389 -0.111502
H  1.199685 2.871956 -0.058539
H  1.595313 -3.045813 0.013069
H  0.031793 -2.933388 0.87063
H  0.079233 -2.956839 -0.924514
H  5.265242 -1.36468 0.063657
H  5.532741 1.168888 0.048115
