program: Gaussian 09
title: 000187525
version: EM64L-G09RevD.01
frameworkgroup: C1[X(C21H24Cl2O4)]
method: RPBEPBE
basis: SDD
operation: Freq
keyword: #p
keyword: freq=noraman
keyword: PBEPBE/SDD
title: #p freq=noraman PBEPBE/SDD
converged: NO YES NO NO
title: Mulliken charges:
elementType: Cl Cl O O O O C C C C C C C C C C C C C C C C C C C C C H H H H H H H H H H H H H H H H H H H H H H H H
charge: -0.048902 -0.038286 -0.176472 -0.286798 -0.210779 -0.165570 -0.112422 0.172124 0.176493 -0.548344 -0.587607 0.334246 -0.578930 -0.572548 -0.767886 0.149092 0.355955 -0.759862 0.158501 -0.371821 -0.641494 0.803579 -0.446302 -0.290147 -0.499994 -0.712748 -0.092270 0.247490 0.236213 0.228803 0.245186 0.240345 0.251341 0.262173 0.246684 0.257047 0.229788 0.244321 0.234674 0.239877 0.223869 0.248340 0.258872 0.268688 0.243060 0.234471 0.246244 0.235663 0.219990 0.241897 0.174156
chargesum: 0.00000
title: Mulliken charges with hydrogens summed into heavy atoms:
elementType: Cl Cl O O O O C C C C C C C C C C C C C C C C C C C C C
charge: -0.048902 -0.038286 -0.176472 -0.286798 -0.210779 -0.165570 0.135068 0.172124 0.176493 -0.083328 -0.102077 0.334246 -0.065416 -0.068817 -0.059103 0.149092 0.355955 -0.047775 0.158501 -0.112949 -0.641494 0.803579 -0.446302 -0.021459 0.223781 -0.015197 0.081886
polarizability: 3.16155347e+02 -2.78854337e+00 2.60692129e+02 -1.62122130e+01 2.21803381e+00 1.85518960e+02
1716.lowfreq: -3.3612 0.0011 0.0019 0.0021 0.7527 6.1036 25.3301 30.0830 36.6488
frequency: 25.2226 30.0049 36.6322 50.3852 61.8770 64.6924 68.2006 80.4094 91.9083 95.5057 113.3095 122.5510 136.1606 145.7461 160.9530 170.5684 181.2255 182.3750 185.8780 200.6289 211.6322 216.2421 238.0538 267.0032 280.4793 286.7906 288.2114 309.5773 328.7352 335.6049 352.2630 371.1273 389.6610 395.9346 406.5142 421.7627 434.6066 466.6304 476.6016 493.4117 519.4596 539.9132 557.2497 568.8001 628.4906 637.0550 651.0334 671.1526 678.4092 711.1264 732.9246 748.8107 764.5685 778.0717 803.4406 829.5609 852.3929 864.1188 880.6400 887.2360 901.6758 906.7759 918.2429 937.3285 946.1886 950.4774 970.9154 992.6189 1017.0186 1031.7859 1041.6761 1075.0971 1085.1774 1089.7708 1100.9184 1111.8209 1113.6829 1118.8460 1128.6642 1146.7455 1151.7288 1165.4053 1191.3863 1195.8725 1209.3322 1226.8355 1242.6250 1247.2512 1255.4696 1256.7287 1268.8330 1274.9623 1283.5020 1301.1586 1308.8368 1337.3177 1350.4886 1356.8073 1368.8082 1374.6044 1382.3284 1392.6051 1398.3558 1406.7730 1422.6043 1436.8389 1440.5947 1450.9268 1451.4826 1458.7892 1460.2252 1464.2671 1467.1914 1473.4190 1480.1817 1485.1440 1487.3350 1495.1581 1543.8465 1594.6194 1629.3954 1633.8945 1640.4219 2866.4793 2966.7701 2968.1578 2970.2606 2981.5793 2991.7130 2995.6689 2996.4328 2999.2454 3005.9801 3011.0887 3033.8456 3053.6320 3074.8934 3078.6597 3083.7771 3084.4909 3100.7367 3103.5927 3107.4241 3108.6157 3118.6967 3150.7315 3170.7781
redmass: 7.7903 4.9303 5.4219 3.7948 3.8647 7.5468 3.3359 5.3881 2.5358 1.4059 4.4756 3.2229 1.8622 2.9718 2.5743 3.6361 2.6682 1.8608 2.1785 2.0535 3.5991 5.3432 2.8182 4.2462 2.8577 3.5102 3.4411 2.9473 3.9842 4.3827 4.5003 3.3001 5.0221 2.9496 2.6025 4.9863 3.9743 3.8921 3.5459 3.0084 4.1795 4.9587 5.2074 4.4270 3.6166 3.9066 3.8350 5.1766 4.8878 5.0332 4.9226 5.0068 5.2211 3.6617 3.8918 2.4265 1.8203 3.4265 1.6096 2.3798 1.4278 2.1814 2.1398 2.5980 2.6770 1.8139 2.3312 2.0567 2.1454 1.8133 2.3592 2.7335 3.2196 2.2255 2.3152 3.0092 1.2701 1.9497 2.2378 1.5581 1.7789 2.7433 2.1742 1.9994 1.7395 1.7321 1.7299 3.0053 2.2670 1.8566 2.0661 1.3284 1.4995 1.5335 1.5398 1.6359 1.3462 3.5866 1.4806 2.1899 1.2759 1.2016 1.2756 1.1866 1.1717 1.7867 1.1286 1.0879 1.0508 1.3688 1.0923 1.0513 1.0898 1.0489 1.0662 1.0703 1.0678 1.0618 7.5449 9.1273 9.8528 9.0093 9.3762 1.0854 1.0814 1.0790 1.0661 1.0621 1.0369 1.0575 1.0418 1.0587 1.0294 1.0368 1.0937 1.1012 1.0987 1.1008 1.0981 1.0979 1.0989 1.1000 1.1008 1.1046 1.0986 1.1051 1.0909
irintensity: 0.1451 0.0236 2.8192 5.9450 2.6536 5.5668 0.9906 2.8172 0.7125 0.0677 0.6306 0.4485 1.2422 3.2881 0.7216 0.8738 0.3319 0.6569 1.5878 0.4899 7.1663 5.2602 1.1513 1.6776 1.2820 6.5897 1.1228 2.8311 3.8972 6.9763 2.7022 10.1807 3.1972 1.9461 0.9594 0.9279 0.9070 1.6589 2.1822 6.8301 9.8935 6.8062 2.4335 1.6826 1.0383 2.3227 20.5128 2.1892 11.8355 6.4927 21.8684 10.8622 8.4564 11.5823 19.2834 5.0609 1.4138 32.1426 19.5684 0.4875 1.1973 17.4282 19.9024 8.3118 0.3274 3.2212 17.5113 5.1213 4.9728 50.5382 26.1601 20.2873 9.5582 84.2914 23.9577 50.1841 0.2908 5.1467 6.2698 46.0315 7.7833 50.1021 44.8579 6.0106 15.3077 5.5001 8.4300 5.2227 66.8119 13.4336 89.0822 4.4016 8.1129 16.6412 0.7786 8.3851 8.1727 9.5314 10.2130 13.4345 16.8439 7.0084 4.7478 45.5795 18.1726 30.5054 5.3651 14.5835 12.9001 7.5131 8.7727 10.3433 31.3687 12.2088 5.3544 15.6410 3.7309 13.0423 33.0891 35.1009 164.6446 187.5813 130.9783 147.6627 9.2070 21.7542 8.7836 8.0656 40.4197 10.5516 10.0798 32.1258 34.8435 16.7792 9.6265 29.3818 16.3143 9.4804 37.7334 27.0978 26.6005 9.7733 10.0525 23.1587 21.7305 12.2916 0.8100
temp: 298.150 k
press: 1.00000 atm
elementType: 17 17 8 8 8 8 6 6 6 6 6 6 6 6 6 6 6 6 6 6 6 6 6 6 6 6 6 1 1 1 1 1 1 1 1 1 1 1 1 1 1 1 1 1 1 1 1 1 1 1 1
symmnumber: 1
zpe: 1056018.8 jmol-1
zpe.correction: 0.402216 hartree
zpe.thermalcorrener: 0.430300 hartree
zpe.thermalcorrenthalpy: 0.431244 hartree
zpe.thermalcorrgfe: 0.342838 hartree
zpe.sumelectzpe: -2033.629665 hartree
zpe.sumelectthermal: -2033.601581 hartree
zpe.sumelectthermalent: -2033.600637 hartree
zpe.sumelectthermalfe: -2033.689043 hartree
dipole: 0.6118 -4.0150 3.8012
dipole: 5.5627
quadrupole: -183.6259 -185.1162 -172.5881
quadrupole: -4.1346 -4.9642 -5.9415
quadrupole: -3.1825 -4.6728 7.8553 -4.1346 -4.9642 -5.9415
hfenergy: -2034.0318809 hartree
pointgroup: C01 [X(C21H24Cl2O4)]
dipole: -0.3744439 -1.3851005 -1.6525421 debye
polarizability: 312.8846904|5.190357|260.0964762|-25.774501|6.5810702|189.3852691 unknown
InChI: InChI=1S/C21H24Cl2O4/c1-11(10-24)17-15(22)7-14-13(18(17)23)5-6-16-20(14,2)8-12(25)9-21(16,3)19(26)27-4/h7,10-11,16H,5-6,8-9H2,1-4H3
charge 0 multiplicity 1
51 atoms
Cl 2.635076 -3.083051 -0.178742
Cl 4.06451 2.303259 -0.855043
O  -3.092068 3.700923 0.324423
O  -3.944804 -1.26245 -1.306367
O  -5.040894 -1.734445 0.682807
O  5.622304 0.094461 1.28367
C  -1.869941 -0.210675 0.390745
C  -0.843502 0.955373 0.628932
C  -3.391719 0.146592 0.608073
C  -1.424405 -1.479398 1.148375
C  -1.281182 2.171715 -0.260771
C  0.561346 0.449411 0.207391
C  -3.748998 1.4190 -0.241731
C  -0.112322 -2.021305 0.549247
C  -0.716162 1.452842 2.103433
C  -2.743078 2.541067 -0.021279
C  0.901063 -0.935915 0.212976
C  -3.823479 0.354548 2.081354
C  -4.218611 -1.036936 0.048789
C  1.560095 1.396412 -0.125945
C  2.230994 -1.284275 -0.136251
C  3.262958 -0.371171 -0.46431
C  2.858961 0.986195 -0.446738
C  4.677485 -0.804119 -0.824008
C  -4.697364 -2.373061 -1.939778
C  4.999413 -0.65607 -2.334141
C  5.752336 -0.148767 0.064466
H  -1.794086 -0.442919 -0.693234
H  -2.198545 -2.267004 1.08293
H  -1.292014 -1.264014 2.224258
H  -1.155792 1.898711 -1.328494
H  -0.673552 3.069049 -0.056078
H  -4.760296 1.784154 0.007061
H  -3.724933 1.145427 -1.314615
H  -0.337013 -2.586712 -0.378439
H  0.347241 -2.754393 1.237069
H  -0.556405 0.618986 2.807536
H  0.156264 2.12458 2.189943
H  -1.601535 2.022674 2.428193
H  -3.423807 -0.434984 2.738599
H  -3.495321 1.333436 2.463494
H  -4.922959 0.312798 2.158048
H  1.332508 2.46495 -0.128943
H  4.762177 -1.884455 -0.579228
H  -4.47935 -3.323657 -1.424939
H  -4.345223 -2.39348 -2.980486
H  -5.78105 -2.175506 -1.88851
H  4.311533 -1.274744 -2.9352
H  6.030152 -0.999746 -2.540472
H  4.91062 0.390311 -2.669466
H  6.725179 0.034979 -0.462303
