program: Gaussian 09
title: 000185074
version: EM64L-G09RevD.01
frameworkgroup: C1[X(C15H20O3)]
method: RPBEPBE
basis: SDD
operation: Freq
keyword: #pfreq=noraman
keyword: PBEPBE/SDD
title: #p freq=noraman PBEPBE/SDD
converged: YES YES NO NO
title: Mulliken charges:
elementType: O O O C C C C C C C C C C C C C C C H H H H H H H H H H H H H H H H H H H H
charge: -0.230645 -0.418238 -0.236946 -0.028291 -0.590463 0.497920 -0.702232 -0.700453 0.288075 -0.538356 -0.418282 -0.394179 -0.384429 0.128182 -0.357655 -0.371066 -0.489558 0.174856 0.204901 0.212038 0.213182 0.230581 0.206488 0.215379 0.215439 0.228179 0.205388 0.246185 0.226813 0.236243 0.239159 0.237434 0.222421 0.244118 0.275776 0.301562 0.236344 0.374131
chargesum: 0.00000
title: Mulliken charges with hydrogens summed into heavy atoms:
elementType: O O O C C C C C C C C C C C C C C C
charge: -0.230645 -0.044106 -0.236946 0.176610 -0.165243 0.497920 -0.049785 -0.051447 0.288075 -0.065359 -0.182039 -0.155020 0.075426 0.128182 -0.113538 -0.095290 0.048348 0.174856
polarizability: 2.53436348e+02 -3.51967107e+00 1.31403698e+02 6.68012773e+00 1.50187850e+01 1.42293579e+02
1716.lowfreq: -12.9653 -4.1772 -1.5564 -0.0006 0.0003 0.0010 16.1017 20.5160 26.3927
frequency: 15.4809 20.3175 26.3701 45.5943 58.1424 61.2567 79.3084 103.4569 129.0139 143.7326 171.7803 218.0413 226.6222 245.5916 257.4651 277.0342 311.3517 361.4444 372.3543 390.4170 404.6085 423.9272 446.8735 474.1814 503.0456 526.8877 566.3188 588.0238 631.1649 633.1719 637.4726 688.6051 743.6658 765.1200 796.3519 819.3460 832.3101 854.1172 868.3198 884.2107 906.9550 921.1542 953.0333 958.7937 961.3285 972.9491 999.6738 1003.4197 1014.5204 1035.1405 1073.8396 1077.6456 1087.5295 1104.8784 1127.3623 1160.6884 1180.1537 1191.7364 1208.1651 1220.3459 1223.7615 1237.0485 1247.5031 1265.4887 1283.7666 1310.3733 1323.1792 1327.5462 1343.7168 1348.7538 1377.3891 1380.5350 1385.0772 1394.0231 1412.2495 1434.2071 1443.5712 1461.4249 1465.7380 1468.3741 1473.4658 1482.8769 1488.3455 1500.4483 1557.6347 1591.1819 1618.8536 1667.2986 2961.9953 2965.2794 2970.4925 2973.4075 2984.2074 2991.7727 3008.8749 3021.6284 3036.7569 3049.1414 3064.4374 3068.9631 3070.2178 3076.5735 3079.7690 3124.9740 3128.1176 3151.9609 3158.2937 3512.1502
redmass: 5.6687 4.0451 6.5732 4.2129 3.4620 3.9385 2.9631 3.2110 4.5700 3.9592 4.7756 1.0729 2.0931 1.1296 3.4552 4.3934 4.2405 2.1699 3.3691 2.0839 2.7946 3.5235 3.1790 4.4624 1.7682 3.5460 2.6440 4.3277 2.8642 6.3753 1.3817 2.6095 3.4153 2.9003 2.1791 3.0572 1.8185 1.7611 1.5972 1.5120 2.9877 1.2113 2.0523 3.0954 1.6301 1.4715 1.4456 2.2670 2.5636 2.2640 2.1053 1.7040 1.4941 2.2057 1.3662 1.3295 2.0575 1.1741 1.3649 2.9079 1.2535 2.0586 1.4762 1.4437 1.2290 1.3170 1.6054 1.5705 1.6113 1.4741 1.2402 1.7895 3.8904 1.2188 3.2412 1.1092 1.0878 1.0924 1.0447 1.0938 1.0547 1.0600 1.0652 2.4775 6.8266 7.7078 6.4953 8.0115 1.0780 1.0608 1.0352 1.0375 1.0636 1.0632 1.0799 1.0792 1.1025 1.0948 1.0998 1.0987 1.1000 1.0992 1.1023 1.0879 1.0888 1.0948 1.0959 1.0639
irintensity: 0.2984 0.5441 0.9351 0.1887 0.4159 1.1774 0.1440 4.0168 0.4491 1.6447 2.9876 0.1205 2.7852 0.1782 1.2475 0.3126 6.9851 0.0317 5.9284 7.5869 0.3316 11.7825 14.5755 25.5124 32.0687 5.1617 5.1930 17.8702 6.9562 1.5099 120.9325 4.3974 3.8584 14.8072 20.1031 1.4751 32.8230 1.8602 25.1949 0.4839 15.3836 2.0282 1.5731 33.3802 3.4649 3.5224 11.7553 100.8087 4.4722 102.0775 90.2708 8.7678 1.8008 0.5625 14.8502 22.6733 7.0645 74.5477 46.2040 18.0171 1.2786 108.6638 0.8285 25.3053 25.9824 0.0410 65.3398 2.0562 65.9565 5.8455 20.7074 42.5854 6.0460 14.0061 21.2671 21.9176 21.7727 40.2391 3.9608 5.3799 0.2093 15.2913 19.1765 1.9278 93.6969 114.1317 34.3910 224.2154 19.6506 34.5909 40.2509 23.1830 56.9894 14.4189 7.6842 28.4108 17.5098 6.0008 24.1481 55.3348 7.5782 104.9601 18.2551 11.3559 15.5729 18.5081 3.0418 18.9189
temp: 298.150 k
press: 1.00000 atm
elementType: 8 8 8 6 6 6 6 6 6 6 6 6 6 6 6 6 6 6 1 1 1 1 1 1 1 1 1 1 1 1 1 1 1 1 1 1 1 1
symmnumber: 1
zpe: 829458.6 jmol-1
zpe.correction: 0.315924 hartree
zpe.thermalcorrener: 0.335107 hartree
zpe.thermalcorrenthalpy: 0.336051 hartree
zpe.thermalcorrgfe: 0.264763 hartree
zpe.sumelectzpe: -807.923959 hartree
zpe.sumelectthermal: -807.904775 hartree
zpe.sumelectthermalent: -807.903831 hartree
zpe.sumelectthermalfe: -807.975120 hartree
dipole: -4.4811 0.0255 -2.4493
dipole: 5.1069
quadrupole: -106.8453 -108.9153 -107.4898
quadrupole: 8.1844 -5.5267 3.0176
quadrupole: 0.9049 -1.1652 0.2604 8.1844 -5.5267 3.0176
hfenergy: -808.2398826 hartree
pointgroup: C01[X(C15H20O3)]
dipole: 1.7629043 -0.3013085 -0.9155708 debye
polarizability: 253.1600729|-8.43271|125.086971|-5.0187973|-10.3185383|148.8865814 unknown
InChI: InChI=1S/C15H20O3/c1-11(2)10-12-6-8-13(9-7-12)14(16)4-3-5-15(17)18/h6-9,11,17H,3-5,10H2,1-2H3
charge 0 multiplicity 1
38 atoms
O  -1.799267 0.316678 1.513406
O  -6.106065 -1.951646 0.023933
O  -6.457294 0.312981 -0.340966
C  5.25224 -0.955878 -0.248528
C  4.629313 0.455951 0.038109
C  3.111855 0.490228 0.118898
C  4.960338 -1.969277 0.882421
C  4.818906 -1.518569 -1.622066
C  0.246815 0.529309 0.262858
C  -2.094807 0.850866 -0.849837
C  2.323118 0.755582 -1.03283
C  2.434921 0.254702 1.348165
C  -3.614682 0.824186 -0.598781
C  -1.247821 0.542947 0.393517
C  0.915591 0.774708 -0.96719
C  1.030837 0.271333 1.420772
C  -4.146816 -0.592173 -0.307418
C  -5.657061 -0.6410 -0.220446
H  6.350196 -0.791513 -0.280369
H  4.970734 1.143777 -0.760047
H  5.056419 0.826548 0.990653
H  3.879595 -2.190941 0.950965
H  5.293635 -1.585734 1.865308
H  5.488606 -2.922219 0.694166
H  5.336562 -2.472976 -1.831525
H  3.730871 -1.712361 -1.646856
H  5.059884 -0.8158 -2.442211
H  -1.795281 1.852117 -1.221968
H  -1.820768 0.138933 -1.656067
H  2.823461 0.956091 -1.987655
H  3.022702 0.066552 2.254336
H  -3.858873 1.480112 0.255457
H  -4.137449 1.23935 -1.480093
H  0.343755 0.987312 -1.876502
H  0.507434 0.093393 2.36623
H  -3.733102 -0.967924 0.646379
H  -3.83159 -1.313911 -1.08732
H  -7.10011 -1.945634 0.084697
