program: Gaussian 09
title: 000187519
version: EM64L-G09RevD.01
frameworkgroup: C1[X(C20H24Cl2O4)]
method: RPBEPBE
basis: SDD
operation: Freq
keyword: #p
keyword: freq=noraman
keyword: PBEPBE/SDD
title: #p freq=noraman PBEPBE/SDD
converged: NO YES NO NO
title: Mulliken charges:
elementType: Cl Cl O O O O C C C C C C C C C C C C C C C C C C C C H H H H H H H H H H H H H H H H H H H H H H H H
charge: -0.039140 -0.051609 -0.178033 -0.267617 -0.222164 -0.435518 0.180656 -0.120878 -0.238503 -0.533767 -0.610041 0.390907 -0.578375 -0.563510 -0.769570 0.354618 0.163694 -0.400976 0.177538 -0.648997 0.711490 -0.451624 -0.233495 -0.351704 -0.699154 -0.502729 0.257930 0.275219 0.232853 0.240391 0.251429 0.259064 0.258446 0.245647 0.262209 0.261576 0.226754 0.233598 0.232095 0.261635 0.248943 0.220844 0.203768 0.219605 0.230064 0.229511 0.236665 0.240770 0.246658 0.342831
chargesum: 0.00000
title: Mulliken charges with hydrogens summed into heavy atoms:
elementType: Cl Cl O O O O C C C C C C C C C C C C C C C C C C C C
charge: -0.039140 -0.051609 -0.178033 -0.267617 -0.222164 -0.092687 0.180656 0.137052 0.036716 -0.060524 -0.099548 0.390907 -0.074283 -0.039725 -0.077124 0.354618 0.163694 -0.139341 0.177538 -0.648997 0.711490 -0.451624 0.015447 0.072909 -0.019975 0.221365
polarizability: 3.14061633e+02 1.78800539e+00 2.51654885e+02 1.08123083e+01 7.13932705e+00 1.74526520e+02
1716.lowfreq: -3.9324 0.0009 0.0010 0.0016 2.4576 12.7591 23.2620 26.2770 31.4602
frequency: 23.2253 26.1877 31.1580 33.3125 60.8456 67.5963 73.7895 82.9499 88.7577 95.1074 114.1579 136.4250 162.6965 172.3088 174.7987 185.9021 190.7921 195.3228 210.0364 220.6241 227.1486 253.3804 256.8057 278.0313 292.2152 297.0589 309.2493 318.3402 329.6898 362.0426 376.8525 394.3966 403.2225 410.8858 423.1095 464.1182 472.2316 485.7655 510.5939 544.6855 551.5173 563.1772 608.4547 623.5811 652.5957 668.5302 680.5138 725.4914 727.7848 753.3663 767.5594 801.1365 815.9176 834.1561 857.5966 865.3128 885.6926 900.6377 914.7948 926.8785 932.9725 939.9538 957.8092 984.5363 985.9830 1005.0120 1015.1285 1036.0359 1063.3137 1074.3938 1087.4542 1100.4490 1107.9543 1113.1424 1131.5531 1139.6759 1141.6964 1149.2144 1150.4135 1160.9140 1182.7026 1203.1928 1223.3503 1228.5477 1239.0919 1246.3848 1251.1371 1259.1302 1279.6677 1287.7879 1295.5388 1298.1476 1308.7193 1316.8485 1328.2040 1342.4464 1343.8989 1363.3277 1366.7923 1375.5047 1391.5249 1399.4398 1405.3905 1422.2906 1431.8354 1438.7689 1448.0284 1452.1633 1457.6441 1463.8568 1470.8831 1472.6646 1476.2042 1480.4445 1485.5011 1492.7688 1538.3395 1586.4057 1635.5531 1639.1929 2972.6376 2980.5522 2982.1863 2987.7221 2992.1063 2994.6495 2997.9866 3005.7748 3006.0728 3021.2395 3043.5851 3051.4739 3054.0078 3067.1514 3077.8285 3082.8519 3083.3360 3084.1021 3093.0212 3102.3990 3108.8869 3152.4387 3165.8707 3557.3016
redmass: 5.6425 4.5557 6.6721 6.6796 5.9754 4.7791 4.3944 4.4505 3.0705 1.2447 5.3247 4.1627 2.8553 2.8877 3.8722 3.1376 1.9929 1.4793 2.2988 4.2150 2.2309 4.1627 4.4557 4.2894 3.1067 3.2108 2.2309 1.8544 4.7355 3.9368 5.3998 3.4452 3.2683 4.0970 2.7116 3.6348 3.2966 4.7193 3.9851 3.7911 4.7994 3.4875 4.8230 3.4918 3.9079 5.3403 4.8930 4.1800 4.9849 4.7542 4.3909 4.2938 2.8288 2.1643 2.1432 2.9147 1.5243 2.8727 2.5041 1.4155 2.3149 2.1584 2.2433 3.4344 2.6710 2.1538 2.2010 2.0279 2.1151 2.4891 2.4640 2.7034 2.4543 1.2805 2.0208 2.5940 2.6599 1.4622 1.4645 1.4727 2.9248 1.7909 1.5814 1.8170 1.5097 3.2348 1.9958 1.5527 1.4940 1.3417 1.6996 1.4541 1.5891 1.8143 1.2968 1.7072 1.6306 1.7439 1.2593 1.8356 1.2604 1.4805 1.2067 1.1829 2.2626 1.0953 1.0837 1.0501 1.2583 1.0509 1.0672 1.0954 1.0543 1.0910 1.0655 1.0577 6.5122 8.5123 9.3854 9.4457 1.0670 1.0740 1.0692 1.0362 1.0381 1.0645 1.0624 1.0608 1.0299 1.0810 1.0928 1.0837 1.1013 1.0977 1.1001 1.1022 1.0982 1.0981 1.0988 1.0990 1.1046 1.1050 1.0911 1.0660
irintensity: 0.6714 1.1511 0.7303 0.3887 1.0814 2.2495 2.7946 0.3584 0.7787 0.0897 0.6616 1.2555 2.5928 4.5727 1.6855 0.9603 1.1262 1.2663 2.0619 1.5541 1.7042 3.4460 11.2326 1.6315 28.1303 17.8182 20.4997 94.6005 26.0854 0.8537 1.5143 3.9531 3.8903 2.4109 6.7537 1.2105 2.8519 1.2844 7.9525 0.9150 3.4102 0.3564 3.0597 2.1832 23.6238 3.2087 11.8620 21.5833 14.2716 5.2020 7.2085 16.5106 13.6161 0.3710 3.2931 26.4500 9.5855 1.1461 13.0637 19.5117 13.9064 11.0246 7.4737 59.1316 25.8904 6.7219 6.6334 21.5930 8.0829 0.9583 5.9127 53.8437 20.2360 0.4968 36.0192 138.0202 60.1182 0.2215 16.8801 29.8987 3.7337 8.8557 14.5675 31.3353 1.9849 11.2218 67.2112 76.9403 41.7261 9.3430 19.1240 10.1710 39.0086 2.3540 9.2714 7.9655 5.8848 5.8918 5.9337 0.7272 17.5843 7.5781 18.3966 19.8434 20.3604 28.1913 11.4089 14.1559 7.4077 11.2810 2.3856 19.8034 10.9747 8.9536 13.8115 7.8393 38.0037 32.7178 214.8484 148.0201 10.2375 6.9997 4.5521 36.4029 15.8871 1.7231 32.7492 62.5900 27.8031 13.8134 12.8744 0.1506 33.5775 9.9046 14.7807 47.0223 3.4181 43.6655 22.9926 19.5917 24.2484 12.9873 1.3551 3.9066
temp: 298.150 k
press: 1.00000 atm
elementType: 17 17 8 8 8 8 6 6 6 6 6 6 6 6 6 6 6 6 6 6 6 6 6 6 6 6 1 1 1 1 1 1 1 1 1 1 1 1 1 1 1 1 1 1 1 1 1 1 1 1
symmnumber: 1
zpe: 1047645.3 jmol-1
zpe.correction: 0.399027 hartree
zpe.thermalcorrener: 0.426000 hartree
zpe.thermalcorrenthalpy: 0.426945 hartree
zpe.thermalcorrgfe: 0.340310 hartree
zpe.sumelectzpe: -1995.589713 hartree
zpe.sumelectthermal: -1995.562740 hartree
zpe.sumelectthermalent: -1995.561795 hartree
zpe.sumelectthermalfe: -1995.648430 hartree
dipole: -1.6885 -3.0105 3.8383
dipole: 5.1620
quadrupole: -176.1457 -178.6588 -174.3795
quadrupole: 16.2936 -2.8952 -1.7163
quadrupole: 0.2490 -2.2641 2.0152 16.2936 -2.8952 -1.7163
hfenergy: -1995.98874 hartree
pointgroup: C01 [X(C20H24Cl2O4)]
dipole: -0.6245574 1.3366511 -1.3956533 debye
polarizability: 313.9515001|-2.7283084|249.8224201|-10.5279069|14.3500201|176.4691181 unknown
InChI: InChI=1S/C20H24Cl2O4/c1-10(9-23)17-16(21)7-15-12(18(17)22)4-5-14-13(19(25)26-3)6-11(24)8-20(14,15)2/h7,10,13-14,23H,4-6,8-9H2,1-3H3
charge 0 multiplicity 1
50 atoms
Cl 2.624853 2.892735 0.788458
Cl 4.106685 -2.190787 -1.209926
O  -2.996989 -3.660333 0.730129
O  -4.450347 1.723525 -1.169013
O  -5.021183 1.211542 1.029599
O  5.076729 -0.21832 2.192649
C  -0.953907 -0.929211 -0.470241
C  -1.952334 0.267092 -0.282842
C  -3.435436 -0.236413 -0.223902
C  -1.55026 1.135148 0.928422
C  -1.195318 -2.014681 0.643093
C  0.511162 -0.440402 -0.343999
C  -0.197172 1.816781 0.662788
C  -3.67032 -1.31615 0.861797
C  -1.183204 -1.574094 -1.868065
C  0.861622 0.84268 0.169276
C  -2.65606 -2.44802 0.740518
C  1.553266 -1.314568 -0.732927
C  -4.384854 0.940365 -0.013545
C  2.238412 1.186107 0.20891
C  3.321982 0.346487 -0.175927
C  2.897147 -0.925782 -0.643357
C  4.780918 0.808858 -0.089276
C  5.654052 -0.071993 0.850603
C  5.441575 0.965848 -1.484839
C  -5.328778 2.918563 -1.090024
H  -1.877622 0.907738 -1.185795
H  -3.684721 -0.657162 -1.216159
H  -1.490156 0.525709 1.85021
H  -2.312461 1.912789 1.118409
H  -0.894013 -1.599491 1.625849
H  -0.570538 -2.905625 0.457512
H  0.162773 2.317389 1.579185
H  -0.327235 2.624541 -0.08641
H  -4.688647 -1.734028 0.795819
H  -3.57474 -0.848807 1.862001
H  -0.516479 -2.435102 -2.041666
H  -2.214143 -1.956565 -1.967684
H  -1.006528 -0.83713 -2.671939
H  1.327053 -2.312384 -1.116484
H  4.760859 1.807937 0.377264
H  6.611411 0.449805 1.017804
H  5.864985 -1.058675 0.396225
H  6.465095 1.368961 -1.370251
H  5.509754 0.005619 -2.023082
H  4.867891 1.673113 -2.109418
H  -5.235455 3.400538 -2.072905
H  -4.990915 3.588796 -0.281891
H  -6.369342 2.611067 -0.893541
H  4.237536 -0.740915 2.123991
