program: Gaussian 09
title: 000187474
version: EM64L-G09RevD.01
frameworkgroup: C1[X(C19H12O3)]
method: RPBEPBE
basis: SDD
operation: Freq
keyword: #pfreq=noraman
keyword: PBEPBE/SDD
title: #p freq=noraman PBEPBE/SDD
converged: YES YES NO NO
title: Mulliken charges:
elementType: O O O C C C C C C C C C C C C C C C C C C C H H H H H H H H H H H H
charge: -0.220519 -0.280836 -0.243914 -0.284182 -0.202558 0.233958 -0.229992 0.381992 -0.005312 -0.344889 0.237191 -0.468857 -0.421221 0.107650 0.281812 -0.430088 0.317378 -0.372801 -0.360932 -0.238273 -0.224170 -0.235470 0.260374 0.254172 0.248157 0.242955 0.247703 0.284440 0.250571 0.230580 0.281174 0.233120 0.235431 0.235358
chargesum: 0.00000
title: Mulliken charges with hydrogens summed into heavy atoms:
elementType: O O O C C C C C C C C C C C C C C C C C C C
charge: -0.220519 -0.280836 -0.243914 -0.023808 0.051614 0.233958 0.018165 0.381992 -0.005312 -0.101934 0.237191 -0.221154 -0.136782 0.107650 0.281812 -0.179517 0.317378 -0.142221 -0.079758 -0.005153 0.011261 -0.000112
polarizability: 3.36143837e+02 -6.69189338e+00 2.78020249e+02 -1.77334067e-01 -9.74604073e-01 8.99806741e+01
1716.lowfreq: -6.7339 -2.3647 -0.0009 -0.0008 0.0005 1.2290 26.2305 42.7772 72.9871
frequency: 26.2235 42.7515 72.9857 75.6816 100.3808 143.2906 164.8646 192.4180 204.9065 252.4349 278.2760 293.8858 322.4372 341.7651 388.5170 398.3839 405.0742 442.5262 454.0099 482.7339 485.5979 501.7548 571.7006 581.1134 602.7426 614.8977 621.6083 636.4579 644.2323 684.2973 691.9991 705.1399 726.3484 761.7489 778.7061 785.2476 816.8540 822.8581 850.3229 852.2650 865.5573 877.6313 936.1786 940.9284 948.9647 957.6890 987.6236 989.0336 994.9823 1006.4495 1007.5151 1013.4833 1030.2876 1042.9476 1078.5084 1089.8346 1131.8457 1133.0489 1170.8264 1177.1801 1193.6462 1200.0783 1216.0328 1251.8681 1270.9483 1289.8620 1314.5892 1329.4769 1334.2315 1341.4608 1364.5070 1379.3658 1386.6912 1429.8534 1440.3274 1454.2299 1481.6462 1502.3619 1547.4155 1559.7226 1584.6844 1605.9260 1613.0397 1627.8215 3041.5795 3050.3015 3125.3396 3132.7509 3136.1421 3142.4856 3154.5902 3160.5941 3163.3304 3166.6415 3179.0026 3187.1053
redmass: 3.7337 5.8628 6.7485 6.8829 5.1192 5.7086 7.2324 4.5733 5.7518 7.6665 5.6360 7.4798 7.1055 3.6679 4.8757 2.8132 5.5861 4.4547 3.8804 4.0185 9.8636 4.4029 5.4174 4.8641 5.8520 6.3823 5.1747 4.8826 4.3569 4.4057 1.8721 3.7138 3.3356 2.9712 2.4590 2.0820 5.3886 5.2478 2.2247 2.1577 1.4426 1.7301 5.3290 1.4647 1.8123 2.1206 1.6781 3.4478 1.3756 2.1884 1.3551 3.2074 2.1396 2.7045 1.4291 1.6026 1.3486 2.1271 2.2324 1.0659 1.6758 1.2991 2.9219 2.0448 2.0521 1.9377 2.2515 1.2344 1.8654 1.5656 4.2189 2.4328 8.2817 3.6251 2.3828 5.7413 2.2922 5.6108 7.7275 7.7680 5.9095 7.6990 6.0693 8.5380 1.0852 1.0833 1.0873 1.0852 1.0888 1.0886 1.0939 1.0997 1.0957 1.0978 1.0981 1.0912
irintensity: 0.0302 4.2745 0.9465 0.1779 2.3878 1.5531 1.8195 0.4385 3.1877 0.4348 3.0007 3.7557 2.5611 1.4677 0.3674 0.0398 4.5067 4.3117 3.3291 4.2294 2.2623 4.6776 5.2360 6.9957 2.4755 0.1962 9.3368 4.7289 12.5579 11.0485 51.6056 4.0710 3.2498 17.9636 16.6587 67.3436 6.8708 14.5595 24.3381 20.4015 67.6627 1.0573 4.9057 3.6495 3.6967 11.7563 0.8801 1.4433 0.2555 4.3210 0.7601 27.9598 16.5214 33.0490 0.3979 13.8215 4.0993 25.4742 10.1588 0.8087 6.0994 40.5515 31.9292 18.8076 10.7476 24.0584 136.7098 4.1984 77.7253 57.3237 152.5318 45.8590 15.1979 9.8284 34.1109 8.1533 13.3599 32.1218 101.4974 11.0127 61.9505 304.5352 7.4720 56.2078 1.9914 13.0584 4.0306 0.6722 8.2396 5.0030 21.7952 21.4326 9.7997 22.4299 10.1431 5.0127
temp: 298.150 k
press: 1.00000 atm
elementType: 8 8 8 6 6 6 6 6 6 6 6 6 6 6 6 6 6 6 6 6 6 6 1 1 1 1 1 1 1 1 1 1 1 1
symmnumber: 1
zpe: 661293.3 jmol-1
zpe.correction: 0.251873 hartree
zpe.thermalcorrener: 0.268416 hartree
zpe.thermalcorrenthalpy: 0.269360 hartree
zpe.thermalcorrgfe: 0.206895 hartree
zpe.sumelectzpe: -955.284762 hartree
zpe.sumelectthermal: -955.268220 hartree
zpe.sumelectthermalent: -955.267275 hartree
zpe.sumelectthermalfe: -955.329741 hartree
dipole: -0.8787 -2.2375 -0.3974
dipole: 2.4365
quadrupole: -86.0639 -146.2872 -129.4556
quadrupole: -3.5421 -0.0362 -1.0981
quadrupole: 34.5383 -25.6850 -8.8534 -3.5421 -0.0362 -1.0981
hfenergy: -955.5366352 hartree
pointgroup: C01 [X(C19H12O3)]
dipole: -0.3264464 0.891518 0.1323957 debye
polarizability: 336.4103023|5.4118171|277.5768837|0.8373919|-5.7793263|90.1575742 unknown
InChI: InChI=1S/C19H12O3/c20-14-10-16(11-4-2-1-3-5-11)22-18-13(14)8-6-12-7-9-15-19(21-15)17(12)18/h1-10,15,19H
charge 0 multiplicity 1
34 atoms
O  -1.704054 3.23999 -0.263026
O  0.479498 0.101795 0.084633
O  0.084999 -4.058823 -0.062991
C  -1.987565 1.883345 0.356554
C  -2.978948 2.458262 -0.597185
C  -1.887775 0.410995 0.098431
C  -4.357172 2.160963 -0.074522
C  -3.237784 -0.112547 0.124984
C  -0.800648 -0.477215 0.075043
C  -4.419089 0.801966 0.190359
C  -0.987747 -1.884417 0.033231
C  -3.417497 -1.528439 0.119605
C  -2.312687 -2.392303 0.062412
C  0.195748 -2.787298 -0.023833
C  1.615391 -0.725717 0.027665
C  1.487584 -2.099051 -0.030958
C  2.866393 0.060858 0.030479
C  4.133217 -0.581855 0.115557
C  2.819598 1.480836 -0.055646
C  5.319985 0.176148 0.109222
C  4.011033 2.234507 -0.060983
C  5.265731 1.587885 0.020035
H  -2.212604 2.074134 1.419094
H  -2.862242 2.140295 -1.646425
H  -5.238503 2.809843 -0.102151
H  -5.386403 0.327354 0.39776
H  -4.433092 -1.939139 0.145636
H  -2.431117 -3.48048 0.039371
H  2.378088 -2.727974 -0.09098
H  4.197443 -1.671725 0.195781
H  1.849909 1.981408 -0.121442
H  6.287778 -0.332101 0.177381
H  3.959471 3.326299 -0.130001
H  6.19066 2.174803 0.01581
