program: Gaussian 09
title: 000015817
version: EM64L-G09RevD.01
frameworkgroup: C1[X(C8H15NO2)]
method: RPBEPBE
basis: SDD
operation: Freq
keyword: #p
keyword: freq=noraman
keyword: PBEPBE/SDD
title: #p freq=noraman PBEPBE/SDD
converged: YES YES NO NO
title: Mulliken charges:
elementType: O O N C C C C C C C C H H H H H H H H H H H H H H H
charge: -0.271558 -0.272186 -0.384989 -0.368939 -0.346909 -0.250277 -0.684936 -0.234770 0.260870 -0.211628 -0.482966 0.203890 0.212122 0.194482 0.190937 0.191985 0.180099 0.216249 0.213081 0.210592 0.198399 0.244202 0.310346 0.207854 0.222441 0.251609
chargesum: 0.00000
title: Mulliken charges with hydrogens summed into heavy atoms:
elementType: O O N C C C C C C C C
charge: -0.271558 -0.272186 -0.074642 0.047073 0.038510 0.121806 -0.045014 0.207831 0.260870 -0.003774 -0.008916
polarizability: 1.46558526e+02 1.64196325e+01 8.01090024e+01 6.66827851e+00 8.54326759e-01 8.94712832e+01
1716.lowfreq: -13.4083 -0.0010 -0.0009 -0.0009 4.3277 6.4082 18.8696 41.3295 48.4862
frequency: 16.1004 41.1461 48.4587 71.8317 100.0048 116.4199 129.7342 146.0638 218.9691 233.7192 248.9171 271.9255 331.3790 418.5243 438.3409 505.7708 556.6914 602.4722 644.0411 742.3594 785.5140 809.8805 845.1029 888.4900 929.2993 937.8076 983.3041 995.8203 1001.7602 1044.8584 1047.2551 1077.4643 1084.7429 1104.9846 1126.9166 1149.9636 1211.2944 1214.3269 1234.0251 1271.7565 1275.4687 1283.9582 1309.7098 1341.7282 1357.7047 1389.7706 1402.6777 1410.7287 1464.0387 1470.4255 1474.7693 1477.6648 1483.6821 1489.1030 1494.7360 1608.7169 1651.8423 2908.7331 2937.1269 2959.7177 2966.1839 2975.0071 2992.5241 3010.1283 3024.8356 3056.0800 3073.5946 3074.6738 3095.7073 3112.2245 3218.5854 3554.6604
redmass: 3.9720 1.8164 4.8369 3.4332 3.1956 1.8608 3.5504 2.9998 2.6806 1.1200 3.6994 3.3738 3.8381 3.3832 2.6845 2.1434 1.7222 2.0473 2.9973 1.0728 3.6935 1.1346 2.9987 2.3663 3.1337 1.1516 1.2629 1.1760 7.2925 2.6259 1.8879 2.2823 2.0946 2.7773 2.7581 1.4848 1.3655 2.0980 1.1141 1.2893 1.1640 1.0822 1.4408 1.3297 1.4106 1.2117 1.2644 1.3077 1.1055 1.0738 1.0816 1.0422 1.1694 1.3136 1.2497 6.7175 4.6789 1.0559 1.0630 1.1042 1.0588 1.0363 1.0593 1.1005 1.0993 1.1038 1.1012 1.0995 1.0661 1.0874 1.1163 1.0773
irintensity: 1.6414 1.4005 7.7392 1.6314 1.5554 2.5382 6.5029 1.1912 2.6520 0.0713 0.9533 1.0370 15.7356 0.2057 15.7028 5.9517 54.4901 66.4497 9.8683 9.2025 27.6647 0.2229 3.9125 14.7735 44.4017 0.6241 0.6788 87.8072 205.1784 65.3372 55.5439 6.4040 5.4303 0.8206 2.4094 2.6284 1.5088 156.0853 65.9255 1.6420 0.2013 0.1063 26.1798 5.5801 28.3526 7.9537 19.7709 20.4427 11.5578 3.3115 6.9099 12.2689 92.1355 111.5291 101.5565 102.8392 26.1468 53.4769 99.2829 44.6516 39.5982 32.6738 41.6645 6.8235 9.8062 20.8320 98.4496 55.0954 9.3531 14.6072 7.7066 19.0082
temp: 298.150 k
press: 1.00000 atm
elementType: 8 8 7 6 6 6 6 6 6 6 6 1 1 1 1 1 1 1 1 1 1 1 1 1 1 1
symmnumber: 1
zpe: 580033.0 jmol-1
zpe.correction: 0.220923 hartree
zpe.thermalcorrener: 0.234495 hartree
zpe.thermalcorrenthalpy: 0.235439 hartree
zpe.thermalcorrgfe: 0.178158 hartree
zpe.sumelectzpe: -518.133324 hartree
zpe.sumelectthermal: -518.119753 hartree
zpe.sumelectthermalent: -518.118808 hartree
zpe.sumelectthermalfe: -518.176089 hartree
dipole: -0.8575 -0.7881 -2.9118
dipole: 3.1361
quadrupole: -59.4414 -66.5134 -67.7834
quadrupole: 5.8007 -9.9084 1.0713
quadrupole: 5.1380 -1.9340 -3.2040 5.8007 -9.9084 1.0713
hfenergy: -518.3542472 hartree
pointgroup: C01 [X(C8H15N1O2)]
dipole: 0.3385021 -0.6804147 0.9720081 debye
dipolederiv: -1.4627231 -0.0542251 0.024262 -0.2839159 -0.4574235 0.029603 0.0336645 -0.025414 -0.3795717 -0.6529831 0.0987663 0.0689764 0.175165 -0.4430042 0.0862617 -0.1300786 0.1424012 -0.9072159 -1.4266342 0.2540024 -0.2257418 0.4376758 -0.7404071 0.1789891 -0.03036 0.0216416 -0.3271565 -0.1321704 -0.0427306 0.0077947 -0.0255083 0.0735546 -0.0413859 0.0563261 -0.0545026 0.1066763 0.0764222 -0.0345414 -0.0014967 -0.1040951 0.1241747 -0.0497308 -0.0742008 -0.0525976 0.1305476 0.8372603 -0.0434995 -0.0830952 -0.1379137 0.3704358 -0.0760108 -0.2511932 -0.0658761 0.3693609 -0.0452762 -0.0584052 -0.0267871 -0.0276457 0.0521053 -0.028314 0.013067 -0.0236904 0.0753389 1.4779466 -0.0266574 0.0594561 0.2902491 0.6582555 -0.0143987 -0.1481461 0.178688 0.2822664 1.4606839 -0.5435539 0.1166357 -0.7117645 0.6139152 -0.2554078 0.2284174 -0.2101921 0.9999611 -0.4120318 0.0749644 0.0793858 0.0919708 -0.2058786 -0.103558 0.0346648 -0.0924239 0.0647189 -0.0556701 -0.117612 -0.0882197 -0.1355926 -0.2069566 -0.0344012 0.0191141 -0.0792607 0.0402019 0.0597897 0.0001052 -0.0121353 -0.0104349 0.0651049 0.0382981 -0.0126288 0.0195192 -0.1663643 0.0478371 0.053217 0.0037194 0.0521704 -0.1423101 0.0083234 -0.0157083 0.0241662 0.069466 0.0345277 -0.0085804 -0.0412557 -0.0062804 0.0668656 0.0322272 0.0031562 0.012532 -0.2036703 0.0188232 0.0358247 0.0016577 0.0745558 -0.2012242 -0.0005658 -0.0040687 0.0289289 0.0704108 -0.0478215 0.0021997 -0.0293163 0.0188734 0.0398665 0.0398437 0.0694772 0.0131085 -0.2149873 -0.0713464 0.0431247 0.0159863 0.1192116 -0.2234722 0.003104 0.0348347 0.0432763 0.0346673 -0.2077384 -0.0057191 0.0780703 0.0116835 0.080866 -0.0259991 0.1035318 -0.0185004 0.0505993 0.070068 0.0886816 -0.0208412 0.0227363 -0.1671997 0.0141229 -0.0284967 0.0304497 0.0800601 0.0890185 -0.0150515 0.000615 -0.0119581 0.0670666 0.0543841 -0.0603067 0.0200772 -0.1796631 -0.1375394 0.1001426 -0.0164878 -0.0281195 -0.2252641 0.0043379 -0.042418 0.0434706 0.0619011 0.0600278 -0.0376851 -0.0177842 -0.0875101 0.0661542 0.0418086 -0.014438 -0.044079 -0.0718277 0.2180917 0.0772179 0.0181904 0.1237496 0.3125761 -0.002826 0.0819984 0.0041963 0.1057438 0.0609776 0.0674449 -0.0205112 0.0533716 0.1248083 0.0795934 0.0395321 0.0537832 -0.1172539 -0.0074699 0.0707969 0.0872069 0.0749357 0.1342705 -0.0143739 0.102554 -0.023001 0.037449 0.1479302 0.0217727 0.0217157 0.0243903 0.1631205 0.0360748 -0.0082942 0.0532991 -0.0116588 unknown
polarizability: 147.0548865|-16.702483|81.2572658|1.2154731|-3.8248505|87.8266589 unknown
InChI: InChI=1S/C8H15NO2/c1-3-5-6-11-7-9-8(10)4-2/h4,9H,2-3,5-7H2,1H3
charge 0 multiplicity 1
26 atoms
O  0.670275 -0.380584 0.340829
O  -2.59882 0.142392 -1.436096
N  -1.642416 -0.853792 0.450126
C  3.008534 0.264221 0.322862
C  4.415165 0.068758 -0.289792
C  1.962929 -0.659917 -0.307683
C  5.468266 1.003824 0.34307
C  -0.409833 -1.22025 -0.205994
C  -2.647533 -0.127648 -0.197939
C  -3.784835 0.270939 0.692928
C  -4.843193 0.968389 0.208909
H  3.042193 0.07585 1.41348
H  2.680589 1.312841 0.188402
H  4.369765 0.250384 -1.38299
H  4.732752 -0.986276 -0.160403
H  1.883028 -0.474337 -1.402477
H  2.241769 -1.729052 -0.159401
H  6.465557 0.853218 -0.109204
H  5.189499 2.065096 0.203557
H  5.55803 0.821161 1.43043
H  -0.166937 -2.289858 -0.021258
H  -0.545186 -1.042385 -1.29087
H  -1.700016 -0.988106 1.461048
H  -3.735521 -0.01378 1.753426
H  -5.678896 1.27189 0.847896
H  -4.870965 1.243023 -0.852156
