program: Gaussian 09
title: 000185069
version: EM64L-G09RevD.01
frameworkgroup: C1[X(C11H12N2O5S)]
method: RPBEPBE
basis: SDD
operation: Freq
keyword: #p
keyword: freq=noraman
keyword: PBEPBE/SDD
title: #p freq=noraman PBEPBE/SDD
converged: YES YES NO NO
title: Mulliken charges:
elementType: S O O O O O N N C C C C C C C C C C C H H H H H H H H H H H H
charge: 0.205727 -0.423273 -0.234449 -0.275386 -0.213813 -0.215525 -0.391749 0.022571 -0.117079 -0.689703 -0.177011 0.183205 0.269614 -0.137773 -0.224915 0.382397 -0.385686 -0.343601 -0.770484 0.307136 0.334321 0.290818 0.347580 0.287908 0.258266 0.289549 0.289029 0.258015 0.257463 0.217421 0.399425
chargesum: 0.00000
title: Mulliken charges with hydrogens summed into heavy atoms:
elementType: S O O O O O N N C C C C C C C C C C C
charge: 0.205727 -0.023847 -0.234449 -0.275386 -0.213813 -0.215525 -0.044168 0.022571 0.190057 -0.064564 -0.177011 0.183205 0.269614 0.150134 0.033351 0.382397 -0.096137 -0.054571 -0.037585
polarizability: 2.96553937e+02 1.92998787e+01 1.48382719e+02 -1.05547004e+00 1.62461783e+01 1.12954572e+02
1716.lowfreq: -11.4531 -4.2812 -2.7936 -0.0011 -0.0009 0.0010 16.5830 26.8754 37.7219
frequency: 16.1851 26.8071 37.6990 51.0618 60.4240 61.7935 74.7974 76.5075 98.7797 112.9861 147.9200 176.3751 197.7226 252.0590 272.3627 295.3376 324.1336 350.1273 362.1194 412.1375 454.9728 473.9188 499.7114 502.7834 510.6054 514.3193 546.6199 598.2559 611.3182 617.7120 627.2763 653.5369 663.6158 689.2885 719.8755 722.8611 788.5314 819.1691 843.4269 858.9581 902.5984 942.1615 977.6450 983.9744 993.8696 994.3254 998.5075 1044.3873 1066.6585 1078.5657 1094.9543 1115.4144 1138.4677 1186.2049 1187.0332 1219.9458 1224.8766 1244.3882 1286.8508 1298.5230 1319.7696 1329.9180 1352.7217 1388.7808 1390.6544 1413.2801 1436.3781 1449.5564 1461.3228 1464.5905 1478.2848 1584.1860 1590.2551 1607.6994 1662.9668 2961.9810 3000.2759 3058.1071 3100.1117 3105.2180 3136.9401 3151.6893 3152.8932 3182.6752 3185.6542 3524.6298 3567.5000
redmass: 8.8454 5.3531 5.1814 5.1252 1.3676 6.9876 6.3300 4.7885 5.9842 8.8645 5.3398 6.0825 6.3649 4.9455 7.1465 7.8559 5.3995 4.2416 3.3926 2.9661 3.2177 3.5507 7.6998 4.2495 6.4113 4.1468 1.3236 2.8745 3.6846 3.9589 4.2451 1.7810 5.1568 8.8188 4.4779 4.6247 9.2849 3.2868 1.2973 1.4709 2.4937 4.3482 2.5897 1.3335 1.5620 1.4952 3.0915 1.6564 3.9700 1.7844 2.8927 1.3232 2.2027 1.5488 1.4836 1.4027 3.6151 1.5106 1.7248 1.2921 1.2552 2.5795 6.1473 9.0178 1.2305 3.8226 1.1368 1.0454 1.2866 2.0150 1.6507 7.7750 6.1162 6.3329 9.2921 1.0802 1.0360 1.0580 1.0978 1.1012 1.1074 1.0910 1.0903 1.0946 1.0959 1.0644 1.0787
irintensity: 1.1013 1.2281 0.7053 1.0281 5.4248 11.0090 1.4614 1.2977 5.7980 2.7346 9.3283 2.6803 1.3074 1.5613 3.2298 0.5855 2.1631 3.2570 0.5526 1.2095 9.3855 14.1577 17.5415 19.8147 12.8179 47.6956 93.9242 50.2851 12.0134 19.1362 26.9788 141.8081 22.9649 0.4122 8.4513 7.9194 33.9019 14.4217 9.3063 57.4518 17.9552 24.1732 52.6736 4.9862 4.2198 6.1969 10.1841 15.9617 99.1455 178.9244 8.2800 17.2275 13.3371 191.4357 9.6486 1.3795 409.2126 17.7231 78.5675 4.8980 15.6571 45.5704 57.7011 53.7265 74.1122 33.5940 31.8240 16.1690 197.5399 25.3858 195.9676 3.0682 159.8323 145.2102 200.9627 15.7751 7.7838 5.6673 6.4418 17.5633 0.4645 6.1463 2.6423 0.9241 1.9925 45.1162 48.2358
temp: 298.150 k
press: 1.00000 atm
elementType: 16 8 8 8 8 8 7 7 6 6 6 6 6 6 6 6 6 6 6 1 1 1 1 1 1 1 1 1 1 1 1
symmnumber: 1
zpe: 587136.1 jmol-1
zpe.correction: 0.223628 hartree
zpe.thermalcorrener: 0.242854 hartree
zpe.thermalcorrenthalpy: 0.243798 hartree
zpe.thermalcorrgfe: 0.172156 hartree
zpe.sumelectzpe: -1308.588721 hartree
zpe.sumelectthermal: -1308.569495 hartree
zpe.sumelectthermalent: -1308.568551 hartree
zpe.sumelectthermalfe: -1308.640193 hartree
dipole: -6.7562 0.2706 -3.6373
dipole: 7.6779
quadrupole: -155.6239 -112.7780 -116.6768
quadrupole: -8.5144 13.7248 -1.2550
quadrupole: -27.2644 15.5816 11.6828 -8.5144 13.7248 -1.2550
hfenergy: -1308.8123493 hartree
pointgroup: C01 [X(C11H12N2O5S1)]
dipole: -2.6059312 1.4823459 -0.3693291 debye
polarizability: 298.5320742|-1.1628954|106.4704791|8.5046265|2.8114507|152.8886749 unknown
InChI: InChI=1S/C11H12N2O5S/c1-7(14)12-10(11(15)16)6-19-9-4-2-8(3-5-9)13(17)18/h2-5,10,12,15H,6H2,1H3
charge 0 multiplicity 1
31 atoms
S  -0.845239 -0.201088 -1.26983
O  -2.462349 2.380998 1.286294
O  -0.918833 0.985276 2.314503
O  -4.878734 -1.55369 0.215318
O  5.618224 -0.352275 0.95856
O  5.94177 -0.475552 -1.298215
N  -3.74262 0.452925 0.032237
N  5.178142 -0.399959 -0.256707
C  -2.680056 -0.017558 0.924203
C  -1.702715 -0.996589 0.226055
C  0.941427 -0.297098 -0.867044
C  -1.920838 1.129831 1.582873
C  -4.818277 -0.375266 -0.256356
C  1.46711 -0.225199 0.448604
C  1.818843 -0.394395 -1.980975
C  3.716613 -0.36385 -0.468791
C  2.859315 -0.268546 0.650006
C  3.210727 -0.421127 -1.787424
C  -5.892088 0.212833 -1.159751
H  -3.160557 -0.60926 1.734239
H  -2.285236 -1.845694 -0.162179
H  -0.936371 -1.364372 0.924636
H  -3.707902 1.420136 -0.29269
H  0.808469 -0.101276 1.313644
H  1.407881 -0.46407 -2.993184
H  3.288861 -0.211461 1.653558
H  3.904921 -0.499223 -2.627998
H  -5.987748 -0.413613 -2.063238
H  -6.862466 0.177654 -0.635545
H  -5.686518 1.252411 -1.46639
H  -1.932755 3.095392 1.733288
