program: Gaussian 09
title: 000187456
version: EM64L-G09RevD.01
frameworkgroup: C1[X(C10H18O8)]
method: RPBEPBE
basis: SDD
operation: Freq
keyword: #pfreq=noraman
keyword: PBEPBE/SDD
title: #p freq=noraman PBEPBE/SDD
converged: YES YES NO NO
title: Mulliken charges:
elementType: O O O O O O O O C C C C C C C C C C H H H H H H H H H H H H H H H H H H
charge: -0.222713 -0.281874 -0.459827 -0.454891 -0.433409 -0.412414 -0.213669 -0.264717 -0.160668 -0.127208 -0.187101 -0.049875 -0.204551 0.064087 0.200486 -0.354155 -0.716902 -0.507817 0.233510 0.264941 0.302124 0.254832 0.278840 0.238189 0.365044 0.366793 0.336947 0.194139 0.234252 0.218452 0.248922 0.231815 0.377209 0.240414 0.186431 0.214363
chargesum: 0.00000
title: Mulliken charges with hydrogens summed into heavy atoms:
elementType: O O O O O O O O C C C C C C C C C C
charge: -0.222713 -0.281874 -0.094783 -0.088098 -0.096462 -0.035205 -0.213669 -0.264717 0.072841 0.137734 0.115022 0.204957 0.074289 0.302277 0.200486 0.074237 -0.017713 0.133391
polarizability: 1.59979461e+02 1.89224609e+00 1.29702872e+02 3.58920862e+00 -8.50112741e-01 1.10907617e+02
1716.lowfreq: -9.7034 -6.3870 -0.0005 -0.0004 0.0005 3.2225 15.7309 30.4313 37.4859
frequency: 15.2842 30.0877 37.1997 68.3569 79.9730 83.5363 102.8536 111.1601 130.9016 165.9183 174.4024 191.5164 220.7557 228.5751 240.0564 258.0092 263.2572 303.6454 331.9648 347.9924 367.2630 389.5134 401.3545 415.1536 425.0784 434.2225 440.4545 470.9713 513.4485 528.2184 555.3265 567.6267 602.9623 611.9680 660.5529 713.0704 817.1554 851.1979 858.2330 884.5842 890.4410 904.3535 927.4162 941.7647 979.4055 1012.4734 1036.0906 1039.6302 1045.9730 1049.9541 1056.7326 1064.9371 1084.1380 1108.3693 1116.8920 1125.3727 1148.9723 1177.3616 1181.3035 1215.9351 1227.6456 1246.5661 1251.5315 1258.9662 1275.6629 1280.6694 1303.2759 1305.2457 1316.6871 1333.2895 1336.7636 1343.8865 1365.6914 1381.8913 1384.9462 1390.0203 1402.2418 1431.9884 1456.4145 1461.9222 1470.3932 1473.6377 1478.3483 1653.3627 2920.5807 2951.5469 2959.0964 2987.2113 2995.2194 3003.6670 3011.7135 3047.0065 3060.3178 3075.4151 3077.8759 3086.4994 3092.6027 3103.6331 3505.1331 3526.9835 3545.5875 3564.0829
redmass: 6.6034 3.8971 3.6779 6.2120 3.8606 7.0424 5.9233 2.6511 3.4050 5.4414 1.5256 4.1052 2.1402 2.0325 2.2623 4.8702 3.9088 3.8782 4.8687 1.2374 4.4052 6.0396 3.8308 1.8076 1.5652 1.9486 1.3674 4.4512 3.9193 4.1487 1.8968 3.6569 2.7928 5.1426 3.0936 5.0163 3.4539 4.9683 4.3156 5.1885 3.5281 4.8762 1.3559 5.0995 5.1795 3.2250 3.5127 3.5885 2.6875 3.8650 2.6677 2.6617 2.8414 1.3443 3.1290 1.8035 1.9609 1.6553 1.4539 1.2703 1.1681 1.2627 1.2133 1.2158 1.5157 1.2268 1.2216 1.2314 1.2117 1.5243 1.4228 1.4139 1.3952 1.2383 1.6077 1.1812 1.5791 1.1240 1.0770 1.0604 1.0612 1.0529 1.0454 9.0844 1.0384 1.0827 1.0654 1.0355 1.0846 1.0947 1.0874 1.0845 1.0867 1.0983 1.0858 1.0990 1.0999 1.0973 1.0640 1.0660 1.0653 1.0660
irintensity: 0.0105 0.0744 0.7578 0.2675 1.7468 6.2331 1.3181 4.8113 5.9512 1.4624 1.6122 0.5328 4.4203 8.3299 4.0413 9.3634 14.2380 2.0732 17.8994 76.2052 18.2139 11.1636 11.5767 30.1544 76.3640 52.3242 187.1646 13.8634 21.9163 11.6317 54.9931 3.2166 77.9575 35.9822 114.1830 27.1334 5.8077 72.2642 53.6846 24.1121 24.6863 45.1707 17.6302 260.6550 109.8904 17.5030 63.8358 31.8963 23.2700 17.6904 142.5989 98.0073 130.1125 3.6475 10.5604 24.8635 17.0323 4.2061 40.0326 21.2361 32.2653 16.0612 5.8280 15.0887 25.9733 9.9049 7.9695 36.3417 2.3200 7.1216 4.7469 6.0972 1.2387 44.0468 1.8358 18.0769 18.9586 3.8895 6.2212 14.5230 7.9033 6.7768 24.1211 177.4379 67.5882 28.3561 64.3605 12.1921 23.7265 46.8897 26.2085 6.1237 12.7610 21.8590 1.8317 22.5948 28.1301 35.5681 21.6144 9.0177 23.8593 19.7170
temp: 298.150 k
press: 1.00000 atm
elementType: 8 8 8 8 8 8 8 8 6 6 6 6 6 6 6 6 6 6 1 1 1 1 1 1 1 1 1 1 1 1 1 1 1 1 1 1
symmnumber: 1
zpe: 749738.8 jmol-1
zpe.correction: 0.285560 hartree
zpe.thermalcorrener: 0.305730 hartree
zpe.thermalcorrenthalpy: 0.306674 hartree
zpe.thermalcorrgfe: 0.235602 hartree
zpe.sumelectzpe: -992.137019 hartree
zpe.sumelectthermal: -992.116849 hartree
zpe.sumelectthermalent: -992.115905 hartree
zpe.sumelectthermalfe: -992.186978 hartree
dipole: 0.2569 -1.8095 -2.5749
dipole: 3.1576
quadrupole: -102.1900 -110.0990 -109.1636
quadrupole: 9.5102 -3.9264 1.7009
quadrupole: 4.9609 -2.9481 -2.0127 9.5102 -3.9264 1.7009
hfenergy: -992.4225794 hartree
pointgroup: C01 [X(C10H18O8)]
dipole: 0.5395127 -0.8103328 -0.7717279 debye
polarizability: 151.7078859|13.6261778|135.2481305|8.7072719|-2.0180391|113.6339344 unknown
InChI: InChI=1S/C10H18O8/c1-4(3-16-2)17-10-7(13)5(11)6(12)8(18-10)9(14)15/h4-8,10-14H,3H2,1-2H3
charge 0 multiplicity 1
36 atoms
O  0.634329 0.083563 -1.205397
O  -1.257221 0.808498 0.111872
O  2.955234 2.734658 0.916771
O  0.469524 3.520271 -0.137976
O  3.895862 -0.016062 0.057094
O  -0.234187 -2.272652 0.306796
O  0.6667 -1.134104 2.118733
O  -4.33756 -1.261115 -0.078005
C  2.222489 1.799205 0.059405
C  0.73659 2.135203 0.24558
C  2.51584 0.336976 0.438879
C  -0.127395 1.24209 -0.664918
C  1.455502 -0.610888 -0.190808
C  -2.341202 0.120132 -0.656163
C  0.599175 -1.310355 0.884652
C  -3.305409 -0.362829 0.447799
C  -3.031656 1.054328 -1.65732
C  -3.874062 -2.63377 -0.280577
H  2.499735 1.961904 -1.006189
H  0.461759 1.956754 1.305601
H  2.51171 0.233629 1.536448
H  -0.419748 1.790384 -1.576695
H  1.961483 -1.408641 -0.763111
H  -1.884932 -0.747472 -1.171088
H  3.9077 2.462083 0.939727
H  1.104115 4.089242 0.371049
H  3.990564 0.076243 -0.927346
H  -2.724567 -0.850232 1.259975
H  -3.853305 0.49563 0.871968
H  -2.405311 1.270725 -2.540479
H  -3.959249 0.567959 -2.009865
H  -3.30157 2.008457 -1.170097
H  -0.766814 -2.71364 1.023854
H  -4.756438 -3.204223 -0.610543
H  -3.495579 -3.070827 0.670343
H  -3.081007 -2.708125 -1.052369
