program: Gaussian 09
title: 000187458
version: EM64L-G09RevD.01
frameworkgroup: C1[X(C17H16O8)]
method: RPBEPBE
basis: SDD
operation: Freq
keyword: #pfreq=noraman
keyword: PBEPBE/SDD
title: #p freq=noraman PBEPBE/SDD
converged: YES YES NO NO
title: Mulliken charges:
elementType: O O O O O O O O C C C C C C C C C C C C C C C C C H H H H H H H H H H H H H H H H
charge: -0.226941 -0.460764 -0.276878 -0.467125 -0.445884 -0.478193 -0.158493 -0.241326 -0.151037 -0.159469 -0.087481 -0.091191 0.008871 0.148200 0.196258 0.225253 -0.528677 0.368980 0.394234 -0.344944 -0.404225 -0.406008 -0.407614 -0.240865 -0.233429 0.229461 0.244105 0.241142 0.251608 0.240942 0.371190 0.382997 0.367200 0.401869 0.275161 0.273114 0.240081 0.245063 0.241911 0.232067 0.230838
chargesum: 0.00000
title: Mulliken charges with hydrogens summed into heavy atoms:
elementType: O O O O O O O O C C C C C C C C C C C C C C C C C
charge: -0.226941 -0.089574 -0.276878 -0.084129 -0.078684 -0.076324 -0.158493 -0.241326 0.078424 0.084636 0.153662 0.160417 0.249813 0.148200 0.196258 0.225253 -0.253516 0.368980 0.394234 -0.071830 -0.164144 -0.160945 -0.165703 -0.008798 -0.002591
polarizability: 3.51125268e+02 -1.58231030e+01 1.58701195e+02 6.78912753e+00 2.15460733e+01 1.66412781e+02
1716.lowfreq: -6.6670 -2.0418 -0.0004 0.0006 0.0009 2.2622 12.9204 19.7244 29.7605
frequency: 12.2575 19.6496 29.7514 42.8846 51.1048 70.4724 94.1995 99.0789 113.4006 151.1956 176.4603 183.6665 202.3181 233.0946 243.2062 261.5570 275.9600 281.9616 318.8713 339.4144 352.7716 381.5790 394.2079 399.3731 412.8945 418.3180 441.3004 478.1766 489.9323 493.2047 510.8337 513.6829 520.1283 538.6116 550.2470 578.3799 591.5143 613.2172 619.3894 630.4811 636.3488 685.9242 715.4224 757.4116 758.6298 768.1502 791.4222 841.5107 847.5857 870.8449 887.4521 932.8916 934.8002 945.0685 962.8910 968.0024 972.8414 992.4043 994.7664 998.4851 1021.4513 1022.6285 1031.2198 1044.3918 1050.0535 1063.8811 1071.4907 1085.4527 1097.7198 1129.4651 1160.1546 1174.3368 1179.6062 1187.6162 1217.3584 1223.3012 1229.4878 1237.8713 1253.4515 1268.9063 1274.6733 1275.6769 1298.8933 1303.7683 1307.4010 1334.0390 1349.1058 1353.0769 1381.1345 1399.9215 1402.8228 1413.2964 1426.2563 1436.9778 1462.7434 1512.7509 1579.1162 1603.7506 1631.1084 1647.3590 1709.2768 2931.8813 2957.3879 2987.4196 2992.4048 3006.3312 3124.0257 3130.3347 3134.3575 3143.5643 3146.1520 3164.4293 3186.1259 3481.8928 3521.4732 3545.5249 3559.8177
redmass: 5.1287 7.0165 8.8222 8.5038 8.6470 7.1791 6.6872 7.3074 7.0095 7.3467 6.7409 3.8511 5.7634 4.8898 6.0688 4.6487 5.8139 6.4626 7.4729 5.9309 6.4104 4.5501 3.1240 2.3530 3.7268 1.6735 1.3170 2.6253 3.4893 3.6571 6.2712 6.4516 1.5704 2.5647 3.1755 5.4157 2.2735 3.6168 2.7586 3.9480 5.9029 3.9804 2.6606 6.8077 5.0722 1.5481 2.6720 1.3315 6.4470 6.2742 1.6358 5.8706 5.8752 1.5018 6.5662 5.8840 1.4516 1.3599 5.2967 1.3755 2.4926 4.3850 4.2516 3.2819 3.7197 2.8916 2.8814 3.2168 2.9507 1.7165 1.2704 1.0796 1.3459 1.6928 1.2774 1.2128 1.2172 2.1224 1.2389 1.8918 1.4244 1.7365 1.3285 1.1985 1.2056 1.2776 1.3539 1.8110 1.7966 1.5574 1.6398 5.7867 2.9909 4.2095 2.5089 3.7576 7.5377 5.6247 8.5906 8.8369 9.8778 1.0804 1.0818 1.0843 1.0848 1.0853 1.0858 1.0890 1.0901 1.0921 1.0952 1.1005 1.0949 1.0654 1.0643 1.0656 1.0656
irintensity: 0.1354 1.8250 2.9627 0.1154 0.5476 1.8761 1.7856 1.6336 1.0687 3.1594 1.8638 2.4585 7.0681 0.7658 5.7352 7.8533 6.2618 1.0672 5.0354 1.7627 1.3167 14.0425 0.2055 58.4245 34.2308 44.4201 182.1381 21.6104 4.9215 1.6207 4.5088 27.9711 94.1471 50.3152 59.4034 1.2796 128.7615 33.2755 56.1155 18.1453 18.2261 18.7006 3.6761 11.2825 0.5613 72.1635 3.0046 31.1950 70.8883 14.2197 21.9965 111.4862 20.6903 7.6134 399.7043 11.3184 13.2881 3.1757 808.0836 0.2878 4.9004 69.5696 49.9377 113.5806 11.6673 25.9173 12.3235 6.9592 260.6501 52.4655 3.8886 2.2715 39.6167 276.2908 15.5987 16.7931 10.4165 9.6223 9.2625 121.1577 6.4760 9.9308 53.7911 26.0713 14.9433 40.9643 9.1940 9.2445 5.4862 24.2840 11.1262 4.9657 7.2189 1.3677 19.2787 12.7609 10.1039 18.4167 206.7225 75.9451 215.7010 17.6310 14.4071 11.4585 16.6768 71.9672 1.7711 0.3637 9.4134 0.6395 29.8526 37.4009 3.4611 98.9538 35.6378 21.8385 29.4658
temp: 298.150 k
press: 1.00000 atm
elementType: 8 8 8 8 8 8 8 8 6 6 6 6 6 6 6 6 6 6 6 6 6 6 6 6 6 1 1 1 1 1 1 1 1 1 1 1 1 1 1 1 1
symmnumber: 1
zpe: 803039.5 jmol-1
zpe.correction: 0.305862 hartree
zpe.thermalcorrener: 0.328215 hartree
zpe.thermalcorrenthalpy: 0.329160 hartree
zpe.thermalcorrgfe: 0.251669 hartree
zpe.sumelectzpe: -1257.370732 hartree
zpe.sumelectthermal: -1257.348378 hartree
zpe.sumelectthermalent: -1257.347434 hartree
zpe.sumelectthermalfe: -1257.424924 hartree
dipole: 1.8302 0.7306 -1.3561
dipole: 2.3922
quadrupole: -92.7971 -146.0942 -141.4913
quadrupole: 9.7618 0.0406 5.2834
quadrupole: 33.9971 -19.3000 -14.6971 9.7618 0.0406 5.2834
hfenergy: -1257.6765935 hartree
pointgroup: C01 [X(C17H16O8)]
dipole: 0.72065 -0.1422597 0.5883953 debye
polarizability: 350.6500233|16.9556699|169.4430013|-9.9841654|20.8237953|156.1462195 unknown
InChI: InChI=1S/C17H16O8/c18-11-12(19)14(15(21)22)24-17(13(11)20)25-16(23)10-6-5-8-3-1-2-4-9(8)7-10/h1-7,11-14,17-21H
charge 0 multiplicity 1
41 atoms
O  2.335472 -0.582264 0.387947
O  4.69106 2.810958 -0.276033
O  0.410057 0.612819 -0.097517
O  5.983531 0.251891 -0.161671
O  2.004504 2.740535 -1.2623
O  5.549247 -2.191649 0.959788
O  3.404076 -2.807564 1.618056
O  -0.257641 -0.890622 -1.769588
C  4.026204 1.536939 -0.555407
C  4.605869 0.401657 0.301272
C  2.528677 1.775591 -0.302502
C  3.734276 -0.875524 0.075095
C  1.77967 0.453666 -0.510903
C  4.133549 -2.050317 0.966925
C  -0.559612 -0.154787 -0.804278
C  -1.920373 0.056296 -0.250817
C  -2.98749 -0.626673 -0.853583
C  -4.322756 -0.469323 -0.372488
C  -4.565232 0.411367 0.754772
C  -2.159641 0.928276 0.8659
C  -3.453608 1.096707 1.351375
C  -5.430384 -1.157332 -0.97314
C  -5.905987 0.567984 1.235466
C  -6.725851 -0.984194 -0.48261
C  -6.964665 -0.114576 0.630384
H  4.172989 1.259163 -1.623322
H  4.566182 0.677483 1.37621
H  2.383599 2.120617 0.742115
H  3.858724 -1.192377 -0.986941
H  1.827506 0.108247 -1.564283
H  5.664574 2.678165 -0.410568
H  6.366245 -0.559494 0.269821
H  2.595787 3.537004 -1.22656
H  5.807452 -2.973838 1.518107
H  -2.781456 -1.287214 -1.70369
H  -1.312359 1.448931 1.317897
H  -3.63859 1.76164 2.2030
H  -5.242065 -1.821901 -1.824523
H  -6.090432 1.233213 2.087277
H  -7.566335 -1.51203 -0.945829
H  -7.986172 0.012226 1.005547
