program: Gaussian 09
title: 000187419
version: EM64L-G09RevD.01
frameworkgroup: C1[X(C20H18O2)]
method: RPBEPBE
basis: SDD
operation: Freq
keyword: #pfreq=noraman
keyword: PBEPBE/SDD
title: #p freq=noraman PBEPBE/SDD
converged: YES YES NO NO
title: Mulliken charges:
elementType: O O C C C C C C C C C C C C C C C C C C C C H H H H H H H H H H H H H H H H H H
charge: -0.443794 -0.458173 0.199987 0.019756 0.297438 -0.199840 0.132905 -0.245191 0.391866 0.182219 -0.637185 0.255484 -0.763075 -0.281371 0.321225 -0.276853 -0.892703 -0.359528 -0.403562 -0.860310 -0.280713 -0.271414 0.254077 0.254016 0.278496 0.221493 0.218986 0.235711 0.227734 0.248830 0.252816 0.248750 0.250814 0.244251 0.233792 0.232746 0.358119 0.354265 0.228242 0.229697
chargesum: 0.00000
title: Mulliken charges with hydrogens summed into heavy atoms:
elementType: O O C C C C C C C C C C C C C C C C C C C C
charge: -0.085676 -0.103909 0.199987 0.019756 0.297438 0.054237 0.132905 0.008825 0.391866 0.182219 -0.358690 0.255484 -0.541582 -0.062385 0.321225 -0.041142 -0.163323 -0.110778 -0.152747 -0.149522 -0.052472 -0.041716
polarizability: 3.82932835e+02 1.35905946e+01 2.47588360e+02 -1.08098906e+01 -5.07043232e+00 1.14047973e+02
1716.lowfreq: -9.5946 -5.1035 -0.0006 -0.0004 0.0004 3.4466 28.9036 41.0604 65.9334
frequency: 28.8740 41.0109 65.9318 86.8700 132.9465 153.1761 169.7651 198.1045 217.4089 240.6529 251.1182 258.5375 277.4304 305.4760 317.8435 330.5006 339.2912 348.5727 359.4000 413.2141 421.5076 445.6727 473.3261 492.3098 502.5076 519.1711 531.3831 556.4781 560.7312 579.8703 596.9076 619.7469 631.9667 644.6136 679.6528 719.2241 737.2216 752.3335 769.1977 782.6631 792.9678 828.7717 850.1786 860.8007 880.1748 901.3188 916.0851 937.2803 955.4191 973.2244 980.3002 987.5879 988.5192 998.0466 1020.4472 1042.6273 1044.2803 1048.4488 1049.2929 1068.2317 1086.6377 1130.9126 1156.5553 1173.8239 1181.2856 1183.7994 1215.2574 1242.2012 1264.7310 1269.2567 1275.3640 1297.1740 1306.4114 1326.1281 1351.7658 1356.4897 1362.7734 1372.6988 1381.9408 1398.9112 1399.4224 1402.0544 1412.0219 1439.4161 1451.9830 1472.3245 1476.9320 1485.3902 1491.1647 1496.4985 1543.1454 1560.2175 1590.4550 1614.7424 1622.0681 1632.3394 2970.0687 2972.5161 2990.3771 3047.1984 3053.3202 3077.2814 3083.4397 3084.6856 3129.2737 3135.1273 3143.3535 3146.1222 3154.1646 3164.7986 3166.7144 3243.4923 3452.5621 3541.7205
redmass: 3.9507 4.9057 4.2508 3.7947 3.9595 4.8553 4.1886 2.8336 1.4286 3.6920 4.5024 3.2520 4.0919 3.3996 1.9753 1.8847 2.4310 1.1809 3.9968 5.0292 2.9350 4.2834 5.0118 4.4789 4.2701 4.0210 3.3780 2.0868 2.5613 2.4147 4.1015 2.7113 4.0206 4.9926 5.2872 4.8002 2.0363 4.9873 1.4349 4.8077 2.5053 2.1441 3.8156 3.2063 1.7533 2.0261 2.1069 2.3612 1.3854 1.3253 2.7404 2.1261 1.6152 2.6031 1.9620 2.1721 2.0026 2.0379 1.9018 2.7252 2.1620 2.7313 1.8204 1.1924 1.2112 1.0942 1.3229 1.5622 2.0526 1.8369 1.8489 1.7868 2.4004 2.2458 2.7638 1.1753 2.0597 2.5766 2.4438 1.6709 1.2753 1.7514 2.3855 3.1646 2.1889 1.0461 1.6093 1.0818 1.1421 1.8786 4.1693 7.4260 6.6918 6.0571 6.4954 6.8827 1.0404 1.0378 1.0829 1.0971 1.0935 1.0873 1.0992 1.0982 1.0859 1.0860 1.0910 1.0913 1.0923 1.0985 1.0938 1.0898 1.0644 1.0661
irintensity: 0.0324 0.7900 0.4342 0.9752 5.5413 2.1806 1.4695 0.5017 0.3991 2.8399 5.9862 4.8202 1.2075 0.2023 0.3516 3.4349 2.6344 50.5576 0.6277 1.2179 2.9893 1.7044 1.4320 1.7487 0.4640 2.7077 7.8140 64.1752 32.2099 66.9020 1.9403 7.7221 15.7385 7.5561 4.2657 1.4784 1.9307 24.3199 69.8729 26.5571 40.8483 30.8058 34.6463 9.7326 2.4778 6.0757 3.2608 44.8106 1.0374 0.6697 12.4829 5.6435 2.0241 13.8637 28.1514 34.1572 53.0458 9.8977 5.1553 0.9696 3.2050 14.9117 3.3724 17.2370 35.7650 0.9626 15.7190 11.0212 0.3704 4.4224 1.2891 12.5971 10.8568 10.2249 6.3968 67.1607 14.4678 24.6060 14.1499 4.6762 15.0320 7.3881 15.4068 2.1573 17.2413 14.1482 1.5259 15.0837 21.5882 18.6270 1.6610 2.3420 14.7500 3.9185 31.3584 11.7350 31.6263 38.3656 13.7507 18.1184 18.0667 34.3707 19.8600 18.6361 2.6970 0.8683 4.2232 18.8755 0.9421 38.9083 41.4625 9.0194 32.4772 10.7262
temp: 298.150 k
press: 1.00000 atm
elementType: 8 8 6 6 6 6 6 6 6 6 6 6 6 6 6 6 6 6 6 6 6 6 1 1 1 1 1 1 1 1 1 1 1 1 1 1 1 1 1 1
symmnumber: 1
zpe: 847297.8 jmol-1
zpe.correction: 0.322719 hartree
zpe.thermalcorrener: 0.341005 hartree
zpe.thermalcorrenthalpy: 0.341950 hartree
zpe.thermalcorrgfe: 0.277073 hartree
zpe.sumelectzpe: -921.842278 hartree
zpe.sumelectthermal: -921.823992 hartree
zpe.sumelectthermalent: -921.823047 hartree
zpe.sumelectthermalfe: -921.887924 hartree
dipole: -2.9482 1.9017 0.2642
dipole: 3.5182
quadrupole: -131.5627 -115.2483 -132.6786
quadrupole: 7.4334 -2.8439 -2.9313
quadrupole: -5.0662 11.2482 -6.1820 7.4334 -2.8439 -2.9313
hfenergy: -922.164997 hartree
pointgroup: C01 [X(C20H18O2)]
dipole: 1.1173663 -0.8096272 0.1093781 debye
polarizability: 383.4809238|6.1095259|246.3244757|16.1233192|7.0838798|114.7637687 unknown
InChI: InChI=1S/C20H18O2/c1-11-9-16-14-7-8-18(21)20(22)17(14)10-12(2)19(16)15-6-4-3-5-13(11)15/h3-10,18,20-22H,1-2H3
charge 0 multiplicity 1
40 atoms
O  -4.30102 1.991487 -0.174872
O  -4.625293 -0.139447 1.523665
C  -2.193352 0.673995 -0.381012
C  -1.528439 -0.571605 -0.302072
C  -0.087611 -0.595394 -0.196549
C  -3.705882 0.725755 -0.608563
C  0.678266 0.636475 -0.092956
C  -4.448248 -0.451029 0.064121
C  -0.036804 1.888118 -0.236977
C  2.135361 0.516553 0.123591
C  -1.442173 1.864333 -0.370682
C  2.778928 -0.780254 0.041017
C  0.607775 -1.861496 -0.225289
C  -2.360938 -1.79061 -0.300101
C  1.983205 -1.980341 -0.161252
C  -3.720544 -1.757886 -0.135462
C  0.589624 3.273401 -0.336169
C  2.977488 1.623354 0.470465
C  4.195548 -0.887189 0.203319
C  2.638849 -3.344721 -0.263267
C  4.362214 1.491625 0.649115
C  4.988787 0.228753 0.490622
H  -3.895841 0.670778 -1.699171
H  -5.484504 -0.483284 -0.307482
H  -1.990587 2.805864 -0.478942
H  0.02545 -2.780368 -0.333376
H  -1.879257 -2.768929 -0.386744
H  -4.299843 -2.685344 -0.076676
H  0.904994 3.672794 0.647235
H  1.467506 3.292016 -1.005583
H  -0.154182 3.980383 -0.740421
H  2.545383 2.604855 0.642566
H  4.666336 -1.870914 0.116424
H  1.881424 -4.131344 -0.415711
H  3.349474 -3.393469 -1.110252
H  3.207154 -3.597969 0.652156
H  -4.520637 1.860103 0.789927
H  -3.806657 -0.434085 2.00193
H  4.957064 2.370816 0.920386
H  6.072282 0.125722 0.61394
