program: Gaussian 09
title: 000187375
version: EM64L-G09RevD.01
frameworkgroup: C1[X(C2H8NO3PS)]
method: RPBEPBE
basis: SDD
operation: Freq
keyword: #p
keyword: freq=noraman
keyword: PBEPBE/SDD
title: #p freq=noraman PBEPBE/SDD
converged: YES YES NO NO
title: Mulliken charges:
elementType: S P O O O N C C H H H H H H H H
charge: 0.539333 1.066451 -0.491330 -0.604014 -0.619260 -0.917557 -0.803725 -0.486114 0.285995 0.265953 0.282171 0.354131 0.403917 0.235491 0.245993 0.242565
chargesum: 0.00000
title: Mulliken charges with hydrogens summed into heavy atoms:
elementType: S P O O O N C C
charge: 0.539333 1.066451 -0.491330 -0.604014 -0.619260 -0.159508 0.030394 0.237935
polarizability: 1.23466060e+02 -7.79855732e+00 8.56070282e+01 -3.80312414e+00 -4.21863986e+00 7.34495454e+01
1716.lowfreq: -6.1683 0.0006 0.0007 0.0008 8.2004 11.3886 39.4471 70.0050 72.0218
frequency: 39.4027 69.9673 71.9536 107.1888 122.6913 129.8049 177.6179 199.9506 206.6627 234.8205 282.7353 303.6659 330.0221 424.2343 440.0266 569.6604 585.1088 647.3117 771.6860 827.3530 941.4978 951.3156 969.8395 972.4843 1061.0667 1103.7619 1123.1582 1318.2914 1417.0376 1419.9061 1433.7672 1457.7481 1469.0211 1583.0502 2982.4847 3019.7724 3086.1937 3127.4155 3158.3267 3162.3628 3282.9257 3595.2391
redmass: 3.5698 4.6521 4.3628 1.5974 1.1413 1.8572 5.6173 3.6629 5.4726 4.2087 4.8932 5.0141 8.7351 1.5203 3.2378 6.8788 3.7209 1.8324 10.2800 4.5094 2.7665 1.7627 1.7431 1.7967 2.0264 1.2463 1.2880 1.1340 1.0534 1.1224 1.0530 1.0518 1.0537 1.0853 1.0294 1.0265 1.1056 1.1031 1.1056 1.1062 1.0587 1.0860
irintensity: 6.4927 5.6791 7.3294 4.6780 1.2614 7.4740 1.4914 7.0881 8.8873 23.8800 7.0723 2.6704 13.5927 38.5456 26.5662 6.0797 63.4091 302.7711 56.9961 52.5451 165.6180 66.4277 36.3206 32.9894 70.6361 0.3977 2.3987 6.4429 16.1050 0.4608 14.1571 14.3735 14.0505 87.6811 52.6788 4.2899 27.2777 11.8012 1.7397 2.1530 17.7790 71.4661
temp: 298.150 k
press: 1.00000 atm
elementType: 16 15 8 8 8 7 6 6 1 1 1 1 1 1 1 1
symmnumber: 1
zpe: 294152.9 jmol-1
zpe.correction: 0.112037 hartree
zpe.thermalcorrener: 0.124353 hartree
zpe.thermalcorrenthalpy: 0.125297 hartree
zpe.thermalcorrgfe: 0.072821 hartree
zpe.sumelectzpe: -1099.965240 hartree
zpe.sumelectthermal: -1099.952924 hartree
zpe.sumelectthermalent: -1099.951980 hartree
zpe.sumelectthermalfe: -1100.004457 hartree
dipole: -0.0191 0.3775 -0.0068
dipole: 0.3780
quadrupole: -54.1898 -73.3355 -59.0035
quadrupole: 11.5560 -4.6724 1.7032
quadrupole: 7.9865 -11.1592 3.1728 11.5560 -4.6724 1.7032
hfenergy: -1100.0772773 hartree
pointgroup: C01 [X(C2H8N1O3P1S1)]
dipole: 0.0090408 -0.034226 -0.1444467 debye
dipolederiv: 0.4163967 0.0782063 -0.1112465 0.3718293 -0.0531361 -0.0868616 -0.1185149 0.1060715 0.6639001 1.9423496 0.0989973 -0.0368255 -0.0033603 1.4373351 0.1307232 0.4213477 -0.0913211 1.0477391 -1.5022417 -0.1228337 -0.1985517 -0.0891611 -0.4806762 -0.0289134 -0.3966426 -0.0376978 -0.5505857 -0.7906032 -0.0143121 0.1671101 0.1366282 -0.5903222 -0.1835999 0.0519081 -0.0085284 -0.6366344 -0.4996349 0.0301444 0.1099299 -0.3257157 -0.2071621 0.2706213 0.2424821 -0.2099346 -0.6497144 -0.7339174 0.0376357 -0.2018082 0.1100025 -0.8854009 0.1425997 -0.1859866 0.2410393 -0.6434785 -0.0387496 -0.0232987 -0.0725753 0.0000566 -0.05225 -0.0494315 -0.0560808 0.0076106 -0.1347141 0.7731557 0.0734683 0.1438956 -0.2822024 0.1764675 -0.0804835 -0.0029509 -0.0500468 0.2648899 0.0908792 0.0368423 -0.0160119 -0.0086783 -0.0285165 -0.0380058 -0.0385846 -0.0032553 0.046643 0.0475824 -0.0400351 0.0227799 -0.0505233 0.0622217 0.0475232 -0.0288496 0.0892927 -0.0133534 -0.0496014 0.0381483 -0.0111935 0.0108481 0.1264898 -0.0239427 -0.0022479 -0.0083359 0.0640879 0.2437124 -0.0372162 0.0533452 -0.0419361 0.2238599 -0.0665045 -0.0067704 0.0147021 0.207485 0.2111829 -0.0721946 0.1910786 0.0408009 0.2210232 -0.0691349 0.0910172 -0.0518405 0.3125035 -0.0010414 -0.0251032 -0.0096442 0.1012494 -0.0653109 0.1235982 -0.0248632 0.0871891 0.0376987 -0.0523379 -0.0521496 -0.0599119 -0.031455 0.0068993 -0.0906827 -0.0832004 -0.0922362 0.0496861 -0.0571312 -0.0062996 0.0296294 0.0616174 0.1084786 0.0024949 0.1379368 0.0072913 -0.0661529 unknown
polarizability: 122.2746238|-10.5182753|73.7797618|-5.4902976|-0.5355323|86.4682484 unknown
InChI: InChI=1S/CH5NO2P.CH3OS/c1-4-5(2)3;1-3-2/h2H2,1H3;1H3
charge 0 multiplicity 1
16 atoms
S  -1.378475 1.436262 0.529407
P  0.749659 0.203264 -0.223089
O  1.74245 1.319167 0.677044
O  1.257322 -0.213173 -1.686739
O  -1.853621 0.248971 1.619037
N  0.432218 -1.124696 0.827678
C  -2.38709 1.012116 -1.04251
C  3.161795 0.952548 0.917848
H  -2.257521 -0.059571 -1.249812
H  -2.012398 1.630718 -1.871994
H  -3.436026 1.243397 -0.806766
H  0.467269 -2.072413 0.445849
H  -0.28483 -0.946769 1.55883
H  3.228787 -0.01087 1.455816
H  3.553075 1.766215 1.546486
H  3.719785 0.904236 -0.033884
