program: Gaussian 09
title: 000187372
version: EM64L-G09RevD.01
frameworkgroup: C1[X(C9H15N5OS)]
method: RPBEPBE
basis: SDD
operation: Freq
keyword: #p
keyword: freq=noraman
keyword: PBEPBE/SDD
title: #p freq=noraman PBEPBE/SDD
converged: YES YES NO NO
title: Mulliken charges:
elementType: S O N N N N N C C C C C C C C C H H H H H H H H H H H H H H H
charge: 0.289207 -0.182420 -0.345559 -0.158492 -0.034451 -0.376971 0.039151 -0.027706 -0.670468 -0.711802 0.072571 0.073955 -0.312865 0.212829 -0.797684 -0.832582 0.240202 0.320439 0.204441 0.211162 0.246911 0.234564 0.205271 0.226070 0.337254 0.238217 0.268533 0.237995 0.244958 0.273978 0.273294
chargesum: 0.00000
title: Mulliken charges with hydrogens summed into heavy atoms:
elementType: S O N N N N N C C C C C C C C C
charge: 0.289207 -0.182420 -0.025120 -0.158492 -0.034451 -0.039717 0.039151 0.212497 -0.007954 -0.045898 0.072571 0.073955 -0.312865 0.212829 -0.052940 -0.040352
polarizability: 2.27759415e+02 -4.21959285e+00 1.88392257e+02 1.01054256e+00 2.51936647e-01 8.82872751e+01
1716.lowfreq: -8.6187 -0.0021 -0.0004 0.0009 1.6314 4.7575 19.6558 35.6021 38.8026
frequency: 19.5678 35.5742 38.7931 52.8191 62.2651 83.7917 95.8497 102.1446 110.9379 157.5111 173.8489 187.7596 209.2686 223.9903 237.6800 244.5567 271.1298 330.2812 351.4208 398.0667 425.1145 442.4612 507.5908 534.6866 564.4968 569.3453 645.0204 657.2679 663.1832 687.0119 707.9216 740.5697 799.5912 838.4574 884.1120 890.7267 910.1426 918.3506 944.0775 950.9759 977.1612 989.5537 998.7455 1031.2589 1041.1993 1137.1387 1154.7211 1178.2715 1191.2224 1210.5885 1252.6231 1299.5329 1328.0074 1343.1804 1353.0635 1371.8146 1375.9916 1394.2555 1399.8493 1428.8452 1435.1034 1447.8686 1452.6428 1462.2834 1467.0280 1467.6061 1473.4550 1481.4098 1486.5054 1525.1675 1568.5046 1667.4841 2977.1934 2981.9141 2986.8597 3022.1277 3027.0051 3071.1276 3072.9495 3082.0375 3093.9606 3096.4457 3137.3740 3145.5735 3152.2578 3517.7226 3549.9021
redmass: 1.4628 3.8277 2.6990 2.3275 3.5814 3.9015 5.1170 2.7460 1.2780 6.0464 6.8461 3.3344 1.0261 5.9304 4.6814 1.1733 3.7784 3.0939 3.4393 6.2032 4.6333 3.0201 4.0825 4.5526 1.2983 2.3315 7.7242 6.6711 7.1881 2.1925 6.5607 2.1374 9.6437 2.5699 7.5345 5.0737 3.6674 1.2174 1.8183 2.2847 1.1809 1.3102 2.1611 1.6983 2.7368 2.1666 2.2920 2.4404 2.7698 4.3554 8.1072 1.6390 1.8297 1.2336 1.4587 1.2274 1.2147 1.3783 3.1393 2.1570 1.0532 1.1904 1.1517 1.0734 1.0476 1.0781 2.0793 1.1799 1.0545 2.6350 5.5613 7.1188 1.0375 1.0361 1.0380 1.0282 1.0850 1.0985 1.0983 1.0990 1.1000 1.0998 1.0983 1.1039 1.1055 1.0759 1.0767
irintensity: 4.2683 0.4109 0.6886 4.0265 2.0108 1.9535 2.5693 0.5127 0.7515 1.3564 0.3611 2.2213 0.0950 0.4973 1.7264 0.2907 0.0458 1.2416 2.1310 1.1275 2.3854 0.1170 3.0828 35.8709 64.7237 25.7601 0.0317 14.8531 7.0536 57.5915 13.1309 32.6656 35.9286 0.9034 4.1747 8.6767 28.4901 5.6345 12.6665 15.0847 8.2350 3.3078 67.5225 9.5860 4.5177 32.2381 11.7658 235.4856 65.2308 53.8822 91.7735 87.0383 183.0367 14.3946 107.5126 59.4398 23.2500 15.2149 419.9833 4.2662 15.7558 288.5743 97.5382 17.8480 20.1849 75.1852 876.4297 203.5340 8.0476 582.7149 312.2314 157.5855 25.1039 31.9815 7.1647 20.9332 1.4594 10.3601 14.7906 56.5878 21.0670 42.9857 8.7590 11.3887 13.2239 27.2952 57.3008
temp: 298.150 k
press: 1.00000 atm
elementType: 16 8 7 7 7 7 7 6 6 6 6 6 6 6 6 6 1 1 1 1 1 1 1 1 1 1 1 1 1 1 1
symmnumber: 1
zpe: 639852.0 jmol-1
zpe.correction: 0.243707 hartree
zpe.thermalcorrener: 0.262082 hartree
zpe.thermalcorrenthalpy: 0.263026 hartree
zpe.thermalcorrgfe: 0.194411 hartree
zpe.sumelectzpe: -1097.808646 hartree
zpe.sumelectthermal: -1097.790271 hartree
zpe.sumelectthermalent: -1097.789327 hartree
zpe.sumelectthermalfe: -1097.857942 hartree
dipole: -4.6682 -5.1846 -0.0635
dipole: 6.9768
quadrupole: -93.0746 -94.0828 -103.5107
quadrupole: -16.9320 0.8042 -0.3187
quadrupole: 3.8147 2.8066 -6.6213 -16.9320 0.8042 -0.3187
hfenergy: -1098.0523526 hartree
pointgroup: C01 [X(C9H15N5O1S1)]
dipole: 1.8929736 -1.9873757 -0.0363136 debye
polarizability: 227.5003623|5.3058408|188.6097562|0.2623178|2.2290573|88.3288288 unknown
InChI: InChI=1S/C9H15N5OS/c1-5(2)10-7-12-8(11-6(3)15)14-9(13-7)16-4/h5,10-11H,1-4H3
charge 0 multiplicity 1
31 atoms
S  0.083564 3.306684 0.155842
O  -4.186074 0.664223 -0.006758
N  2.095849 -1.38654 0.065795
N  -0.234268 -1.211735 0.013049
N  1.167958 0.785843 0.092003
N  -2.538806 -1.037327 -0.028542
N  -1.261323 0.997133 0.058861
C  3.493262 -0.896963 0.077672
C  3.963383 -0.513653 -1.345798
C  4.392213 -1.973457 0.717775
C  0.990434 -0.583869 0.053929
C  -1.311594 -0.362884 0.016648
C  0.010601 1.498489 0.096916
C  -3.869354 -0.546723 -0.039213
C  -4.89416 -1.684521 -0.096778
C  1.943711 3.578924 0.205417
H  3.501652 0.015018 0.701843
H  1.915114 -2.391291 0.013202
H  3.96453 -1.396229 -2.012018
H  4.989103 -0.10234 -1.314429
H  3.295056 0.252088 -1.77505
H  4.062091 -2.212186 1.74442
H  4.384783 -2.905676 0.11972
H  5.435924 -1.617601 0.763991
H  -2.412996 -2.053814 -0.056514
H  -4.764452 -2.292236 -1.011632
H  -5.90277 -1.247649 -0.10023
H  -4.797588 -2.354711 0.777681
H  2.077276 4.671781 0.232512
H  2.409056 3.150105 -0.692973
H  2.366225 3.110819 1.105361
