program: Gaussian 09
title: 000185043
version: EM64L-G09RevD.01
frameworkgroup: C1[X(C13H12Cl2N2O3)]
method: RPBEPBE
basis: SDD
operation: Freq
keyword: #p
keyword: freq=noraman
keyword: PBEPBE/SDD
title: #p freq=noraman PBEPBE/SDD
converged: YES YES NO NO
title: Mulliken charges:
elementType: Cl Cl O O O N N C C C C C C C C C C C C C H H H H H H H H H H H H
charge: -0.037804 -0.036009 -0.205936 -0.179276 -0.228086 -0.234264 -0.362843 -0.471623 0.274033 0.173874 0.246551 -0.454215 0.520847 -0.353019 -0.321741 -0.318521 -0.688553 -0.073849 -0.076027 -0.251431 0.294103 0.295074 0.254905 0.251602 0.218906 0.218682 0.306864 0.304279 0.210891 0.210232 0.225189 0.287164
chargesum: 0.00000
title: Mulliken charges with hydrogens summed into heavy atoms:
elementType: Cl Cl O O O N N C C C C C C C C C C C C C
charge: -0.037804 -0.036009 -0.205936 -0.179276 -0.228086 -0.234264 -0.362843 0.117554 0.274033 0.173874 0.246551 0.052292 0.520847 0.084570 -0.014876 -0.014243 -0.042241 -0.073849 -0.076027 0.035733
polarizability: 2.57381540e+02 -2.08303355e+00 2.07873078e+02 -1.07170318e+01 -3.72590700e+00 9.76940104e+01
1716.lowfreq: -7.9351 -5.3194 -3.8856 -0.0022 -0.0013 -0.0012 15.0216 37.5011 42.8390
frequency: 14.9319 37.4918 42.8252 52.2125 65.0826 103.2766 108.5038 115.3425 128.9499 154.2526 162.6228 197.8957 213.9779 226.5367 251.0529 251.8338 259.8406 297.4775 302.6272 354.7022 383.1334 394.8615 412.5396 449.8341 492.2129 510.7325 538.9235 552.2880 587.9822 600.1538 661.2334 674.6030 698.5293 716.4165 737.3190 753.2812 759.1852 858.1694 863.5395 866.0082 872.5219 877.1110 904.0505 977.5990 987.0151 990.9392 1021.4617 1055.7601 1086.5651 1100.8411 1108.1063 1115.5929 1127.4056 1164.5338 1167.0979 1204.8570 1221.8280 1223.3746 1267.9930 1287.0225 1300.4850 1324.3719 1340.5674 1365.3237 1375.3525 1393.5449 1417.3374 1421.4694 1445.1732 1453.4416 1471.4341 1478.2393 1484.9769 1567.7540 1598.4087 1613.4671 1655.2077 1704.8248 2975.4729 2987.5378 3005.7117 3027.0495 3029.8273 3051.1018 3078.6896 3079.1168 3084.5576 3189.7845 3208.3511 3209.9025
redmass: 7.3162 5.4662 5.6372 5.8125 1.9621 3.8606 4.0954 4.8153 10.8271 17.1208 6.7478 4.7106 5.2748 1.1006 3.0401 7.7925 9.4273 6.9551 6.6436 5.0936 12.9407 5.8141 8.6156 5.4529 7.0076 5.1311 3.6930 2.5421 4.4548 9.1326 2.6028 6.5370 4.9501 8.2866 1.2212 7.3641 9.9736 2.7579 1.8876 1.3800 1.3856 1.6512 2.1992 6.6807 2.0194 5.4864 3.0928 2.6808 3.2038 1.5837 1.8259 1.8951 2.5527 1.1769 3.9913 4.4624 2.9590 1.4398 1.2121 1.0819 1.6886 2.4462 3.4887 1.7905 10.3764 1.2149 1.1283 2.7935 2.8960 1.1661 1.0561 1.0420 1.0753 7.4804 7.1287 9.1096 11.5752 12.5589 1.0362 1.0621 1.0608 1.0969 1.0598 1.1004 1.1017 1.0991 1.1034 1.0941 1.0928 1.0939
irintensity: 0.1142 0.1239 0.1706 0.1826 0.0308 1.2729 0.8701 8.1146 6.4661 0.1788 0.1299 0.3610 6.3988 0.0857 3.5846 0.8481 2.3483 18.6183 2.3976 1.2392 15.4235 0.7499 8.2959 0.8137 4.9697 0.0548 0.2412 1.0262 1.5227 33.5834 23.6896 14.6561 71.0726 4.8570 15.9912 15.2833 74.3239 43.1153 16.2397 0.5674 0.6402 17.5358 27.6666 13.5717 1.5337 5.0527 46.5790 4.4274 117.0239 1.2675 21.6246 7.3731 16.2152 4.7709 63.9336 326.9760 363.9380 63.3492 0.8838 0.9803 131.4067 87.7966 325.1961 103.5392 1.4238 8.9181 22.4795 81.6907 141.9452 13.2007 5.0316 13.4296 15.6874 94.7247 141.4273 118.0342 587.0520 30.3233 32.8378 11.0251 18.7711 0.8636 5.5614 0.1495 67.7842 50.2324 0.6447 2.1553 7.0772 3.0193
temp: 298.150 k
press: 1.00000 atm
elementType: 17 17 8 8 8 7 7 6 6 6 6 6 6 6 6 6 6 6 6 6 1 1 1 1 1 1 1 1 1 1 1 1
symmnumber: 1
zpe: 603830.3 jmol-1
zpe.correction: 0.229987 hartree
zpe.thermalcorrener: 0.249424 hartree
zpe.thermalcorrenthalpy: 0.250368 hartree
zpe.thermalcorrgfe: 0.179314 hartree
zpe.sumelectzpe: -1756.469732 hartree
zpe.sumelectthermal: -1756.450295 hartree
zpe.sumelectthermalent: -1756.449351 hartree
zpe.sumelectthermalfe: -1756.520405 hartree
dipole: 1.7795 0.8223 0.2794
dipole: 1.9802
quadrupole: -135.8622 -140.8446 -129.4350
quadrupole: 2.5764 0.3094 -3.8297
quadrupole: -0.4816 -5.4640 5.9456 2.5764 0.3094 -3.8297
hfenergy: -1756.699719 hartree
pointgroup: C01 [X(C13H12Cl2N2O3)]
dipole: 0.7017545 -0.3305286 -0.0722325 debye
polarizability: 257.0154464|3.2196033|206.522931|12.9370396|-12.6534828|99.4102508 unknown
InChI: InChI=1S/C13H12Cl2N2O3/c1-2-3-11(18)16-7-12(19)17(13(16)20)10-5-8(14)4-9(15)6-10/h4-6H,2-3,7H2,1H3
charge 0 multiplicity 1
32 atoms
Cl -3.480051 -3.482403 0.869753
Cl -5.3707 1.319266 -1.171001
O  0.944619 -1.325275 -0.266418
O  -0.893588 2.947363 0.58287
O  4.114954 1.541934 0.25295
N  1.940437 0.80852 0.150037
N  -0.340495 0.661391 0.140339
C  1.45819 2.175101 0.424196
C  0.874454 -0.102395 -0.020103
C  -0.060308 2.034447 0.402194
C  3.348024 0.559414 0.072772
C  3.812369 -0.857565 -0.219152
C  -1.657384 0.089472 0.041247
C  5.348408 -0.970294 -0.27946
C  -2.720651 0.883633 -0.458085
C  -1.881466 -1.247983 0.454518
C  5.799109 -2.416913 -0.569829
C  -3.18288 -1.766516 0.347362
C  -4.000915 0.309491 -0.532352
C  -4.269676 -1.015791 -0.140204
H  1.805818 2.889521 -0.3417
H  1.808325 2.543572 1.403763
H  3.350132 -1.200807 -1.165899
H  3.394096 -1.539147 0.547947
H  5.780483 -0.620079 0.676293
H  5.736884 -0.285869 -1.05628
H  -2.557479 1.918617 -0.759468
H  -1.065276 -1.868154 0.825575
H  5.403364 -2.775916 -1.538613
H  5.447351 -3.11366 0.214328
H  6.900905 -2.486181 -0.610784
H  -5.273148 -1.440791 -0.210699
