program: Gaussian 09
title: 000187400
version: EM64L-G09RevD.01
frameworkgroup: C1[X(C16H20O2)]
method: RPBEPBE
basis: SDD
operation: Freq
keyword: #pfreq=noraman
keyword: PBEPBE/SDD
title: #p freq=noraman PBEPBE/SDD
converged: YES YES NO NO
title: Mulliken charges:
elementType: O O C C C C C C C C C C C C C C C C H H H H H H H H H H H H H H H H H H H H
charge: -0.483849 -0.448551 0.098253 0.436194 0.377587 0.373800 -0.241470 0.572761 -0.613514 -0.605512 -0.412025 -0.417327 -0.714495 -0.435621 -0.441131 -0.481800 -0.691516 -0.694155 0.207340 0.231906 0.240033 0.207614 0.259065 0.295570 0.263249 0.208734 0.194950 0.237050 0.233708 0.232392 0.213198 0.211468 0.226825 0.227593 0.211666 0.211164 0.361905 0.346941
chargesum: 0.00000
title: Mulliken charges with hydrogens summed into heavy atoms:
elementType: O O C C C C C C C C C C C C C C C C
charge: -0.121943 -0.101610 0.098253 0.436194 0.377587 0.373800 -0.034131 0.572761 -0.381608 -0.365478 0.054655 -0.121757 -0.047562 -0.198571 -0.207423 -0.249408 -0.040025 -0.043733
polarizability: 2.89631044e+02 -7.64603273e+00 1.70964949e+02 -4.55923588e+00 -3.62930151e+00 1.11866107e+02
1716.lowfreq: -0.0008 -0.0007 0.0003 3.5175 7.0317 14.9214 23.3437 33.2290 44.8781
frequency: 23.2469 33.1483 44.8267 94.7788 96.8676 132.9622 161.3573 181.6335 194.0657 216.9414 234.8547 244.7770 255.7817 269.1772 304.4585 315.3348 317.0090 333.6852 376.6410 399.8906 414.9586 452.1465 461.4847 478.1432 486.8483 521.3352 528.0144 549.4656 604.8669 631.9460 671.2495 696.6508 722.9988 783.7238 788.8281 821.0730 832.8267 843.0122 879.6835 891.5759 900.3201 911.9358 917.3690 920.5237 931.4158 954.4054 957.3265 963.8495 970.2142 997.5649 1054.3921 1069.7177 1077.6003 1113.3684 1126.4566 1129.8570 1151.4563 1164.0719 1175.7672 1195.1025 1216.9810 1244.3920 1252.7370 1277.7293 1307.0260 1308.8405 1313.5510 1340.4120 1351.7176 1367.6735 1377.7648 1384.9243 1396.2099 1404.2435 1411.4654 1428.3957 1446.1433 1461.0350 1466.8173 1468.0171 1472.5979 1478.6685 1480.4662 1489.7396 1506.3737 1576.3378 1609.0132 1642.2866 2974.2816 2976.2562 2977.2979 2977.6488 2999.0656 3065.5394 3067.3732 3073.9498 3077.0242 3081.3812 3101.8166 3104.5787 3110.2674 3112.0471 3113.6443 3124.1632 3135.7623 3182.9645 3479.6510 3571.0025
redmass: 3.2189 3.9882 3.9958 3.3408 3.9972 3.0877 3.6151 3.3658 3.4550 1.1147 1.1985 1.1113 3.3692 3.1175 3.5304 2.7477 1.5433 2.3040 2.3905 3.3522 3.5874 3.7545 3.2467 2.5487 3.5044 6.5886 1.5612 1.7140 2.9995 5.0707 4.0994 3.4106 4.5205 4.7004 2.5178 1.5683 2.7561 1.3560 2.7878 1.8403 1.7100 2.6635 1.3870 1.4231 2.1023 1.4330 3.3734 4.4399 1.4262 1.3429 1.5706 1.5871 1.6051 2.5851 1.9197 1.6255 1.6367 1.4929 1.8114 1.5678 1.8139 2.1095 1.5598 1.8515 1.3371 1.2978 1.8397 1.4415 1.6242 1.3997 1.1951 1.2181 1.2307 3.3136 3.1465 8.0284 1.0819 1.0937 1.0448 1.0514 1.2942 1.0809 1.3199 1.3085 3.9231 7.1460 5.8413 6.8330 1.0349 1.0514 1.0402 1.0641 1.0640 1.0981 1.1000 1.0994 1.1004 1.0996 1.0995 1.0992 1.0880 1.0900 1.0906 1.0900 1.0972 1.0937 1.0649 1.0662
irintensity: 1.0900 1.0785 0.0381 3.2203 0.0788 2.0272 0.1716 0.6300 1.1803 0.1661 2.2905 0.2959 4.2011 4.5198 2.1804 34.0213 56.1097 21.9438 6.8434 1.0745 0.5476 1.6868 8.4027 12.3547 15.2548 1.3640 96.8507 85.1008 2.2700 4.4027 10.0330 22.4520 2.8014 6.9763 0.2364 7.1248 21.1386 30.1581 0.1299 49.0413 31.4040 16.2170 21.5323 1.7233 9.5825 0.0063 11.7823 102.6955 3.8139 0.2628 7.2000 56.7604 38.2544 1.2362 1.7040 18.2841 46.4588 3.1540 50.1241 9.7294 30.2386 1.4247 17.6834 6.3036 0.7702 12.0396 8.6234 22.9320 16.7829 19.2379 15.5899 21.1575 10.2531 0.2333 0.6303 0.1617 4.0972 4.1200 1.8093 4.3853 6.2161 8.8105 29.0237 3.2854 30.1567 0.0289 20.9597 1.4564 32.1369 37.7538 46.1269 17.8251 27.7778 58.6527 1.9778 111.3100 27.2988 38.6588 9.6671 6.7225 5.9838 36.6454 14.9413 15.4453 28.5600 3.7145 31.9837 12.0559
temp: 298.150 k
press: 1.00000 atm
elementType: 8 8 6 6 6 6 6 6 6 6 6 6 6 6 6 6 6 6 1 1 1 1 1 1 1 1 1 1 1 1 1 1 1 1 1 1 1 1
symmnumber: 1
zpe: 835963.9 jmol-1
zpe.correction: 0.318402 hartree
zpe.thermalcorrener: 0.336427 hartree
zpe.thermalcorrenthalpy: 0.337371 hartree
zpe.thermalcorrgfe: 0.272229 hartree
zpe.sumelectzpe: -770.816657 hartree
zpe.sumelectthermal: -770.798632 hartree
zpe.sumelectthermalent: -770.797688 hartree
zpe.sumelectthermalfe: -770.862830 hartree
dipole: -0.3800 2.6357 -0.2560
dipole: 2.6752
quadrupole: -94.9750 -101.0911 -115.2428
quadrupole: 11.3159 -4.5541 -1.7946
quadrupole: 8.7946 2.6786 -11.4732 11.3159 -4.5541 -1.7946
hfenergy: -771.1350591 hartree
pointgroup: C01 [X(C16H20O2)]
dipole: 0.1564185 -1.0371315 -0.0876124 debye
polarizability: 289.8444531|-6.5914643|170.9472763|1.9295188|2.8836622|111.6703701 unknown
InChI: InChI=1S/C16H20O2/c1-11(2)12-4-5-14-9-15(16(3,18)10-17)7-6-13(14)8-12/h4-9,11,17-18H,10H2,1-3H3
charge 0 multiplicity 1
38 atoms
O  -4.112816 1.417235 -0.330388
O  -5.434769 -0.427017 1.281113
C  -3.50074 0.080752 -0.208891
C  -1.977801 0.252689 -0.192792
C  0.295155 -0.716436 -0.155909
C  0.869295 0.611435 -0.0819
C  4.673169 -0.194143 0.006766
C  3.150181 -0.351055 -0.052545
C  -1.129294 -0.862081 -0.208835
C  2.293131 0.757709 -0.031362
C  -3.963606 -0.50425 1.160475
C  -1.403636 1.565608 -0.11697
C  -3.976565 -0.790238 -1.397641
C  -0.020216 1.736435 -0.065236
C  1.182624 -1.841613 -0.174495
C  2.566252 -1.661454 -0.124584
C  5.129884 0.413545 1.360531
C  5.21684 0.640843 -1.182854
H  5.114895 -1.208594 -0.069183
H  -1.538466 -1.878824 -0.271107
H  2.706128 1.773302 0.023545
H  -3.600434 -1.54122 1.299643
H  -3.583601 0.131473 1.975613
H  -2.085086 2.419538 -0.111156
H  -3.686592 -0.301655 -2.342088
H  -3.534234 -1.802915 -1.378282
H  -5.079688 -0.887128 -1.39766
H  0.404851 2.746347 -0.013564
H  0.760101 -2.85248 -0.230986
H  3.231393 -2.533854 -0.141385
H  4.726895 1.435213 1.490192
H  6.233256 0.475363 1.407411
H  4.779261 -0.19726 2.211852
H  4.919948 0.19839 -2.150698
H  6.321118 0.692981 -1.148018
H  4.829594 1.676217 -1.151885
H  -5.026834 1.335933 0.057972
H  -5.848196 -1.163493 0.7643
