program: Gaussian 09
title: 000187401
version: EM64L-G09RevD.01
frameworkgroup: C1[X(C22H16O4)]
method: RPBEPBE
basis: SDD
operation: Freq
keyword: #pfreq=noraman
keyword: PBEPBE/SDD
title: #p freq=noraman PBEPBE/SDD
converged: YES YES NO NO
title: Mulliken charges:
elementType: O O O O C C C C C C C C C C C C C C C C C C C C C C H H H H H H H H H H H H H H H H
charge: -0.312698 -0.293917 -0.201105 -0.204116 0.092695 0.251321 0.201247 0.154871 0.178690 0.180788 0.048662 -0.402502 -0.383896 -0.352520 -0.379794 -0.365799 0.300561 -0.377705 -0.275215 -0.283618 -0.278539 -0.280032 0.282906 0.275812 -0.757125 -0.759793 0.232305 0.301025 0.226345 0.228362 0.228504 0.283034 0.229006 0.231854 0.232313 0.232223 0.251414 0.249082 0.255569 0.261979 0.248329 0.249478
chargesum: 0.00000
title: Mulliken charges with hydrogens summed into heavy atoms:
elementType: O O O O C C C C C C C C C C C C C C C C C C C C C C
charge: -0.312698 -0.293917 -0.201105 -0.204116 0.092695 0.251321 0.201247 0.154871 0.178690 0.180788 0.048662 -0.170197 -0.082872 -0.126175 -0.151433 -0.137296 0.300561 -0.094671 -0.046208 -0.051764 -0.046227 -0.047810 0.282906 0.275812 -0.001059 -0.000007
polarizability: 3.82475446e+02 -4.93121616e+00 3.20768638e+02 1.36212378e+01 -9.30375274e+00 1.18965598e+02
1716.lowfreq: -1.6627 -0.0007 -0.0006 0.0005 1.2520 8.6565 21.1248 28.1454 41.5740
frequency: 21.0861 28.1199 41.5680 47.8247 56.8683 68.6256 75.6306 83.7670 104.0677 111.1259 128.0042 131.0130 189.4475 222.1629 232.8069 257.2873 268.0613 280.5726 310.2380 328.0364 342.9334 389.7810 400.5743 416.8301 432.1271 453.9506 462.4539 492.7339 523.9130 540.9230 546.2810 553.1611 561.0288 577.6986 595.7845 606.0238 619.1180 647.3900 652.4100 696.6097 721.8534 732.3057 734.8239 753.0425 769.5577 779.3180 786.0009 796.8212 813.6737 831.1548 875.6526 894.3844 918.7887 927.1463 947.1102 957.4375 966.1320 985.0134 989.7590 991.8749 993.1396 996.7959 1037.6534 1041.3015 1045.5021 1049.3142 1072.3039 1074.2368 1112.3084 1143.7478 1156.1033 1170.7246 1179.0784 1187.9602 1192.4071 1237.7602 1249.2323 1267.9554 1278.9911 1307.1574 1321.8365 1366.1612 1370.3322 1381.8674 1382.4441 1391.0280 1407.6958 1433.2621 1443.9604 1450.4416 1451.1072 1453.6126 1454.1660 1455.7731 1485.7629 1498.7676 1550.9920 1574.2869 1586.3052 1606.9785 1613.7415 1620.0210 1679.0825 1687.7449 3006.3819 3006.9118 3094.7169 3098.5304 3129.6029 3132.0895 3142.8495 3143.3315 3146.7305 3150.7371 3162.4509 3169.2511 3176.5607 3182.1702 3209.5619 3218.4252
redmass: 7.2970 5.3436 3.6878 2.4164 2.7097 4.7451 4.9420 1.6023 3.8817 1.0589 5.0372 5.6737 6.6127 7.8054 4.9096 4.4456 4.3460 5.0666 6.7586 5.8504 4.4625 4.3129 6.0599 4.7841 3.5500 3.9909 4.4496 3.9621 4.9605 4.5088 3.2429 3.6520 3.1831 4.6743 4.7622 5.6426 6.5328 5.9695 4.9041 5.0747 6.2349 3.1782 2.5773 3.9870 1.5571 2.5078 4.1410 2.3849 3.1917 1.5273 1.4209 7.7602 7.2529 3.4260 1.4846 1.4136 1.3859 2.1618 1.3569 2.0142 4.5150 1.5028 1.6496 1.6373 4.5200 2.6852 2.3626 3.1093 2.4159 2.1665 1.7844 3.1837 1.1603 1.6438 1.1637 1.9862 2.1953 1.8720 2.5450 1.9070 2.3668 7.0868 3.4675 1.2510 1.2527 7.0458 5.0114 2.5451 2.6825 2.4011 1.1220 1.0646 1.0599 1.0520 2.8257 2.7317 4.2368 7.7751 7.4902 6.7347 5.5449 6.7355 10.3906 10.3487 1.0376 1.0368 1.0974 1.0957 1.0860 1.0856 1.1010 1.1018 1.0909 1.0921 1.0955 1.0971 1.0925 1.0894 1.0960 1.0922
irintensity: 0.6961 0.1220 0.7605 1.3987 4.4070 1.4758 1.5802 0.9170 1.3956 0.2660 5.8283 0.2982 2.7731 3.7287 1.4020 1.1159 0.9570 0.6084 2.4431 0.7698 1.8388 0.5517 1.3684 2.9339 4.8511 2.8383 4.3910 0.7358 7.7081 7.2834 5.5573 9.0664 0.1526 6.2575 0.6569 2.8418 5.6778 2.0089 7.4915 4.1467 7.5923 9.8099 27.5154 0.9985 132.8158 14.9523 45.4639 43.3694 4.6335 10.8152 0.9707 110.4977 45.1224 0.8925 0.5498 0.2254 3.1495 52.0098 0.0715 160.1141 0.7633 2.5679 8.5227 6.3282 14.0437 25.0314 22.9985 102.6235 15.9512 91.9570 83.4241 858.7672 12.0671 21.6088 7.0081 75.5332 8.4676 22.6907 1.1912 1.1418 5.2488 9.1969 9.9640 34.9792 101.1589 4.0784 13.6242 71.1132 13.6766 7.5348 38.8604 7.3229 23.0487 8.1803 18.5140 32.6907 1.4506 3.6300 0.6206 5.7822 0.8233 1.2736 194.0565 175.2360 1.0637 1.8689 5.9089 6.2064 2.5927 1.1806 9.3632 12.6783 33.4914 10.3810 2.3197 14.4470 45.6764 23.9077 0.7440 8.9866
temp: 298.150 k
press: 1.00000 atm
elementType: 8 8 8 8 6 6 6 6 6 6 6 6 6 6 6 6 6 6 6 6 6 6 6 6 6 6 1 1 1 1 1 1 1 1 1 1 1 1 1 1 1 1
symmnumber: 1
zpe: 833206.4 jmol-1
zpe.correction: 0.317352 hartree
zpe.thermalcorrener: 0.339641 hartree
zpe.thermalcorrenthalpy: 0.340585 hartree
zpe.thermalcorrgfe: 0.263785 hartree
zpe.sumelectzpe: -1147.090739 hartree
zpe.sumelectthermal: -1147.068450 hartree
zpe.sumelectthermalent: -1147.067505 hartree
zpe.sumelectthermalfe: -1147.144305 hartree
dipole: 0.0416 2.3596 -1.9321
dipole: 3.0500
quadrupole: -120.4277 -131.1579 -161.0123
quadrupole: -11.9695 10.7202 3.3503
quadrupole: 17.1049 6.3748 -23.4797 -11.9695 10.7202 3.3503
hfenergy: -1147.4080907 hartree
pointgroup: C01 [X(C22H16O4)]
dipole: -0.0620161 0.9215846 -0.766002 debye
polarizability: 383.4586705|-1.4367253|320.2537383|6.1252009|-10.0461923|118.4972733 unknown
InChI: InChI=1S/C22H16O4/c1-13(23)25-20-12-11-19-17-9-4-3-7-15(17)16-8-5-6-10-18(16)21(19)22(20)26-14(2)24/h3-12H,1-2H3
charge 0 multiplicity 1
42 atoms
O  -2.010041 1.322947 -0.277464
O  -3.455088 -0.908794 -0.5101
O  -3.068285 0.837859 1.768755
O  -4.072941 -2.860644 0.662427
C  0.145766 0.078608 -0.291375
C  0.780599 -1.21879 -0.264355
C  0.987803 1.296634 -0.295276
C  2.241616 -1.330467 -0.098753
C  2.412079 1.17672 -0.106709
C  3.041982 -0.147868 0.03303
C  -1.288867 0.092878 -0.306557
C  -0.021586 -2.391225 -0.364329
C  0.452817 2.602982 -0.533829
C  2.886859 -2.603036 -0.020771
C  3.207394 2.361866 -0.098901
C  4.443578 -0.291214 0.266992
C  -2.050834 -1.090051 -0.400383
C  -1.415275 -2.34799 -0.451757
C  1.26048 3.749084 -0.532675
C  2.651807 3.632513 -0.294842
C  4.266172 -2.7197 0.194262
C  5.053437 -1.549641 0.348293
C  -2.917461 1.587736 0.791156
C  -4.387877 -1.80066 0.095689
C  -3.617986 2.897988 0.519066
C  -5.776096 -1.229708 -0.066565
H  0.45008 -3.375073 -0.370161
H  -0.60911 2.706994 -0.745279
H  2.305347 -3.522591 -0.118318
H  4.288136 2.289341 0.043947
H  5.071122 0.594493 0.391453
H  -2.003768 -3.262496 -0.525518
H  0.812797 4.730054 -0.726283
H  3.292166 4.521132 -0.285022
H  4.730134 -3.710127 0.251767
H  6.130568 -1.62749 0.530707
H  -2.87876 3.702738 0.363192
H  -4.270888 3.152355 1.366145
H  -4.216822 2.817155 -0.404902
H  -5.89874 -0.381957 0.631826
H  -6.524631 -2.000035 0.168674
H  -5.924482 -0.847117 -1.089459
