program: Gaussian 09
title: 000185015
version: EM64L-G09RevD.01
frameworkgroup: C1[X(C19H32)]
method: RPBEPBE
basis: SDD
operation: Freq
keyword: #p
keyword: freq=noraman
keyword: PBEPBE/SDD
title: #p freq=noraman PBEPBE/SDD
converged: YES YES NO NO
title: Mulliken charges:
elementType: C C C C C C C C C C C C C C C C C C C H H H H H H H H H H H H H H H H H H H H H H H H H H H H H H H H
charge: -0.374214 -0.357433 -0.342211 -0.410435 -0.355449 -0.480488 -0.710060 -0.172069 -0.220899 -0.218437 -0.161976 -0.541021 -0.162981 -0.530618 -0.153514 -0.167421 -0.443027 -0.158997 -0.667391 0.198540 0.186043 0.209437 0.185707 0.180927 0.189871 0.198630 0.197247 0.193923 0.191731 0.202165 0.210138 0.213283 0.231557 0.208772 0.217834 0.218830 0.221558 0.217202 0.204026 0.209232 0.203638 0.207017 0.219394 0.218173 0.220705 0.202021 0.206369 0.215977 0.215698 0.224567 0.208428
chargesum: 0.00000
title: Mulliken charges with hydrogens summed into heavy atoms:
elementType: C C C C C C C C C C C C C C C C C C C
charge: 0.010369 0.037711 0.028587 -0.014558 0.030204 -0.068185 -0.056448 0.045765 -0.002069 0.003121 0.055226 -0.127763 0.056413 -0.119963 0.064659 0.053284 -0.034637 0.056980 -0.018698
polarizability: 2.64224411e+02 2.24933785e+00 2.19177865e+02 -1.62989231e+01 2.03079266e-01 1.76717069e+02
1716.lowfreq: -8.6964 -0.0007 -0.0006 -0.0003 4.8410 11.5146 16.3171 20.7022 28.0902
frequency: 15.7122 18.3650 27.8433 35.9488 41.6687 43.1072 56.9864 74.4629 93.1765 102.5885 114.1737 123.2481 123.5248 134.8743 157.0014 173.1743 190.8180 206.4787 223.5142 239.7380 251.1484 270.0541 295.8748 299.1171 313.6752 344.8110 364.1499 377.2320 406.6219 440.8766 467.5493 493.4138 500.9049 514.6248 546.5183 720.0089 736.0527 766.1387 766.9222 792.1915 799.5622 803.8221 830.8589 864.1969 872.1346 886.2493 897.9602 905.7952 920.0574 937.4091 941.3849 966.0525 973.1240 976.5469 994.9946 1001.3639 1006.2375 1018.7916 1038.7694 1047.8714 1052.9008 1064.8663 1069.7497 1084.7874 1091.7457 1100.3216 1107.9788 1121.9046 1131.2861 1157.0105 1166.2931 1189.5097 1195.0496 1199.5734 1232.7468 1237.9631 1238.7538 1251.1392 1256.2915 1269.7408 1272.8327 1281.8391 1286.4678 1289.0461 1289.9390 1294.5300 1296.8475 1299.3740 1302.5816 1314.6739 1323.1103 1339.9333 1344.3323 1349.3727 1352.9700 1357.9257 1382.3789 1387.8375 1453.5124 1454.7014 1458.8469 1461.2055 1463.3796 1464.1020 1468.0411 1469.5265 1474.0653 1478.4199 1479.5056 1482.9558 1488.9395 1633.2120 1670.8234 1680.2700 1687.5925 2946.4944 2946.9098 2949.7602 2952.5777 2954.1325 2961.0906 2963.6704 2966.6259 2971.4365 2972.2402 2973.6129 2987.1328 3001.8068 3011.4388 3022.3153 3024.5257 3031.2010 3033.2712 3033.7450 3039.1719 3064.1809 3064.6716 3067.3501 3069.5486 3070.7206 3072.0979 3073.2994 3075.7850 3078.6068 3080.2766 3084.3900 3089.0773
redmass: 3.9073 4.2120 2.9293 2.4134 3.4714 2.2768 3.2112 2.5849 2.5954 3.1503 2.4229 2.2073 2.0147 2.5238 2.3091 2.4196 1.9537 1.6584 2.5320 1.1155 2.1108 1.9005 2.9955 2.2812 2.6832 2.6061 3.3341 3.2194 2.1554 2.7508 2.4922 2.8513 2.2978 2.4705 3.1352 1.0899 1.1642 1.3739 1.3326 1.4713 1.4688 1.4818 2.0329 1.6409 1.8345 1.8984 1.8582 1.9719 1.7185 1.8537 1.1491 1.1464 1.4346 1.1180 2.1370 1.2205 1.8663 1.9493 3.0861 2.6835 2.2528 2.0207 1.6720 2.1087 2.4309 1.5704 2.2919 1.6988 2.1901 1.9099 1.8251 1.4701 1.5508 1.4321 1.3280 1.2544 1.2266 1.2704 1.2514 1.2428 1.2475 1.3979 1.2599 1.0634 1.2748 1.1818 1.2250 1.2583 1.3114 1.3133 1.3378 1.4270 1.4023 1.5098 1.4976 1.5957 1.2021 1.2147 1.0903 1.0954 1.0749 1.0695 1.0819 1.0748 1.0921 1.0849 1.0444 1.0474 1.0747 1.0716 1.0713 6.2294 6.0895 6.3795 6.6546 1.0644 1.0644 1.0586 1.0616 1.0596 1.0610 1.0616 1.0593 1.0403 1.0577 1.0355 1.0963 1.0994 1.1006 1.1022 1.0969 1.0940 1.0942 1.0967 1.1039 1.0941 1.0925 1.1002 1.0995 1.0963 1.0928 1.0929 1.0895 1.0983 1.0934 1.0878 1.0868
irintensity: 0.0306 0.0244 0.0732 0.0560 0.1011 0.1112 0.0417 0.0204 0.2081 0.0677 0.9805 0.1206 0.1390 0.3109 0.1498 0.1788 0.0956 0.6551 1.5803 0.0132 0.7808 1.7615 0.5963 1.3952 0.8883 0.7917 1.6710 3.3546 0.1612 0.8738 0.1135 1.4817 5.0787 0.5573 0.1594 16.5618 1.7853 1.5796 8.5517 2.8503 6.2750 5.0734 7.5482 1.9439 0.0591 3.9118 4.5185 0.6425 7.0603 2.7033 0.4022 19.9461 0.7909 88.2844 18.9332 79.0305 28.7050 11.6339 0.1163 12.4963 1.9491 18.3706 2.4751 2.4333 2.4845 10.1172 1.3197 1.8937 0.9898 0.6463 1.1553 1.1955 0.1029 0.4446 2.4640 0.2889 0.4655 0.7829 2.2711 1.5452 0.4403 1.0805 0.5011 0.0997 1.2353 3.3688 1.4790 0.3853 2.5290 0.8753 1.0418 0.5015 4.4671 0.1061 3.6750 0.8183 13.2525 10.5359 18.5276 7.0971 1.9731 2.1229 9.4939 7.4718 7.1834 5.3608 8.3429 11.4222 7.7107 0.9137 20.2693 3.5104 0.3085 0.4810 0.6531 24.8917 70.7254 1.9683 13.3925 2.6953 35.8195 59.7525 131.1393 43.5520 50.5779 39.8630 2.9084 2.4608 13.9704 2.4332 9.9563 12.1695 3.2794 42.7010 158.5857 0.8130 20.1274 64.9559 67.3579 23.3324 7.3111 38.1292 23.8255 27.5245 39.0605 43.1785 135.5385
temp: 298.150 k
press: 1.00000 atm
elementType: 6 6 6 6 6 6 6 6 6 6 6 6 6 6 6 6 6 6 6 1 1 1 1 1 1 1 1 1 1 1 1 1 1 1 1 1 1 1 1 1 1 1 1 1 1 1 1 1 1 1 1
symmnumber: 1
zpe: 1195878.9 jmol-1
zpe.correction: 0.455486 hartree
zpe.thermalcorrener: 0.479851 hartree
zpe.thermalcorrenthalpy: 0.480796 hartree
zpe.thermalcorrgfe: 0.397348 hartree
zpe.sumelectzpe: -741.630869 hartree
zpe.sumelectthermal: -741.606504 hartree
zpe.sumelectthermalent: -741.605560 hartree
zpe.sumelectthermalfe: -741.689008 hartree
dipole: 0.2270 0.3273 -0.1766
dipole: 0.4357
quadrupole: -118.9135 -122.9451 -114.8762
quadrupole: 0.8388 -1.1258 2.1613
quadrupole: -0.0019 -4.0335 4.0354 0.8388 -1.1258 2.1613
hfenergy: -742.0863556 hartree
pointgroup: C01 [X(C19H32)]
dipole: -0.0832372 -0.132763 -0.0694818 debye
polarizability: 263.2184287|4.0294097|219.3861429|18.2436468|-0.1737934|177.5147735 unknown
InChI: InChI=1S/C19H32/c1-3-5-7-9-11-13-15-17-19-18-16-14-12-10-8-6-4-2/h5,7,11,13,16-19H,3-4,6,8-10,12,14-15H2,1-2H3
charge 0 multiplicity 1
51 atoms
C  -3.59883 -1.154301 0.047858
C  -3.603618 -0.369981 -1.284727
C  -2.72432 -2.427424 -0.012913
C  -4.521077 0.876296 -1.293991
C  -2.710475 -3.229005 1.308852
C  -4.097988 1.997389 -0.297194
C  -1.8321 -4.496989 1.234252
C  -2.706681 2.524269 -0.564197
C  -1.680129 2.540447 0.33886
C  -0.325263 3.007746 0.046383
C  0.703045 3.006871 0.946459
C  2.130621 3.419499 0.634641
C  3.097427 2.260871 0.845111
C  4.71449 0.447583 0.058078
C  3.796495 1.644606 -0.141655
C  4.214617 -0.779158 -0.692083
C  3.336142 -3.172299 -0.845696
C  3.873495 -1.959318 -0.112932
C  1.925065 -3.581732 -0.348255
H  -3.22805 -0.503898 0.865954
H  -4.639992 -1.434252 0.315154
H  -2.566135 -0.059217 -1.522574
H  -3.922709 -1.053352 -2.098913
H  -3.085748 -3.082228 -0.833802
H  -1.683918 -2.143318 -0.277947
H  -5.562555 0.571971 -1.062815
H  -4.538079 1.30418 -2.317633
H  -2.347828 -2.573793 2.127294
H  -3.749863 -3.511583 1.574546
H  -4.83395 2.824677 -0.386363
H  -4.165559 1.626699 0.743489
H  -1.83275 -5.049568 2.192062
H  -0.784018 -4.237095 0.992876
H  -2.195639 -5.184184 0.446722
H  -2.517999 2.898294 -1.584479
H  -1.86351 2.162429 1.357195
H  -0.1347 3.362356 -0.978758
H  0.513469 2.645816 1.969935
H  2.199118 3.784053 -0.407596
H  2.425654 4.263126 1.295345
H  4.805452 0.217105 1.136304
H  5.732411 0.706193 -0.30578
H  3.192283 1.891067 1.878473
H  3.684609 2.002056 -1.177898
H  4.110313 -0.670574 -1.783697
H  4.025126 -4.030708 -0.702372
H  3.304788 -2.967595 -1.933182
H  3.964808 -2.059595 0.981409
H  1.563603 -4.484282 -0.874949
H  1.198365 -2.766493 -0.517477
H  1.937687 -3.803154 0.735731
