program: Gaussian 09
title: 000187344
version: EM64L-G09RevD.01
frameworkgroup: C1[X(C9H19N3OS2)]
method: RPBEPBE
basis: SDD
operation: Freq
keyword: #p
keyword: freq=noraman
keyword: PBEPBE/SDD
title: #p freq=noraman PBEPBE/SDD
converged: YES YES NO NO
title: Mulliken charges:
elementType: S S O N N N C C C C C C C C C H H H H H H H H H H H H H H H H H H H
charge: 0.210270 -0.020451 -0.267366 0.010768 -0.005109 0.060921 -0.321053 -0.378507 -0.361748 -0.345961 -0.658205 -0.452993 -0.638697 -0.640934 -0.677689 0.221016 0.231560 0.228425 0.253024 0.216551 0.260089 0.232808 0.215645 0.296186 0.311406 0.214691 0.248239 0.224514 0.208279 0.250406 0.222993 0.210679 0.218863 0.221383
chargesum: 0.00000
title: Mulliken charges with hydrogens summed into heavy atoms:
elementType: S S O N N N C C C C C C C C C
charge: 0.210270 -0.020451 -0.267366 0.010768 -0.005109 0.060921 0.131523 0.102942 0.114891 0.102492 -0.050614 -0.452993 0.048747 0.040744 -0.026764
polarizability: 1.99827629e+02 1.39361846e+01 1.70211247e+02 -8.58911404e+00 1.70857460e+01 1.26638745e+02
1716.lowfreq: -10.4613 -7.5118 -0.0028 -0.0027 -0.0013 3.0234 17.6527 27.4504 31.5583
frequency: 16.9824 27.3536 31.2996 58.0288 62.9426 80.8639 83.2847 90.3555 101.6341 136.3435 153.0006 193.9945 213.9693 222.4145 235.5246 276.9577 292.8186 297.4207 329.3287 348.7998 359.6102 376.7875 394.1788 416.5578 461.0329 475.8251 536.3743 580.4969 641.9267 666.3244 734.9480 762.7940 781.2484 810.1816 821.5475 855.0019 885.8612 899.0667 906.6523 959.0588 1002.2630 1008.7677 1048.4532 1068.0297 1077.1236 1094.7356 1109.1430 1145.3080 1150.0221 1192.0125 1197.6767 1258.9921 1264.3888 1288.8310 1293.1437 1300.2780 1311.2392 1329.3823 1339.9120 1351.4381 1355.6265 1358.6839 1384.1681 1391.2077 1391.8899 1397.0729 1425.0197 1450.5272 1462.5955 1466.4584 1469.4744 1470.6085 1479.9237 1481.2500 1483.6727 1484.5337 1501.2525 2976.8822 2987.8727 2990.5667 2991.4705 2997.7188 3004.4948 3008.7565 3012.7955 3047.5455 3059.8078 3069.4126 3070.6981 3080.3685 3087.3066 3087.5461 3089.0316 3102.1787 3103.9736 3114.2287
redmass: 4.3276 5.0929 3.5980 3.0932 3.4495 3.2222 3.1302 2.6535 4.4254 3.4738 7.1354 2.1766 1.0286 1.4708 1.1425 3.1259 3.9145 4.4639 4.5015 3.9264 3.6530 2.7960 2.9891 3.4958 5.4105 5.2564 3.4279 5.1427 6.8273 4.2181 1.1184 1.7303 1.1676 1.7014 2.8233 1.3510 3.0431 2.5102 2.5033 2.6703 2.2206 2.8007 3.0092 2.2567 1.8600 1.8514 2.1911 1.9077 1.7649 2.4776 2.4555 1.3757 1.3683 1.1201 1.2340 1.3507 1.4950 1.6646 1.2571 1.2828 1.3634 2.2564 1.2123 1.2026 1.2096 1.2154 1.8941 1.0888 1.1058 1.0487 1.0614 1.0676 1.0440 1.0561 1.0719 1.0654 1.2824 1.0358 1.0357 1.0362 1.0627 1.0603 1.0609 1.0611 1.0586 1.1002 1.1026 1.1010 1.1024 1.0989 1.1001 1.0998 1.1054 1.1018 1.1014 1.1017
irintensity: 1.6096 0.9459 4.6355 0.4432 1.2006 0.4960 0.8671 2.0402 1.1543 0.2984 2.7753 1.4941 0.2687 0.8206 0.1187 0.3122 0.5174 2.1038 1.0117 11.5892 14.2992 1.6118 12.7801 14.0379 0.6338 12.6161 4.1258 3.0071 53.8561 14.3002 18.7275 5.3067 1.6162 56.2543 10.3731 17.7242 66.2954 74.3069 12.6795 27.8567 89.0455 26.9960 1.2795 15.4827 20.6636 12.2995 2.6077 30.5897 9.8996 95.2717 13.7995 28.5893 93.4304 4.7933 14.3317 14.6039 75.2704 35.1165 8.7578 25.4582 2.4944 34.7551 14.6262 22.9028 19.6141 18.8380 120.9452 15.4557 21.0832 15.9726 2.9639 4.1509 14.3663 7.2382 23.3878 16.0062 79.7971 32.7194 28.2824 27.8891 35.8936 3.3245 28.6999 36.8080 39.4444 0.3181 6.6325 2.8166 12.4799 35.1428 29.0516 34.9420 51.3369 10.5453 41.7629 18.0226
temp: 298.150 k
press: 1.00000 atm
elementType: 16 16 8 7 7 7 6 6 6 6 6 6 6 6 6 1 1 1 1 1 1 1 1 1 1 1 1 1 1 1 1 1 1 1
symmnumber: 1
zpe: 734187.4 jmol-1
zpe.correction: 0.279637 hartree
zpe.thermalcorrener: 0.298891 hartree
zpe.thermalcorrenthalpy: 0.299835 hartree
zpe.thermalcorrgfe: 0.229142 hartree
zpe.sumelectzpe: -1388.681279 hartree
zpe.sumelectthermal: -1388.662025 hartree
zpe.sumelectthermalent: -1388.661081 hartree
zpe.sumelectthermalfe: -1388.731774 hartree
dipole: 5.0559 2.2199 -1.1171
dipole: 5.6336
quadrupole: -103.2676 -112.2174 -108.5534
quadrupole: -13.5786 -10.3520 -4.0011
quadrupole: 4.7452 -4.2046 -0.5406 -13.5786 -10.3520 -4.0011
hfenergy: -1388.9609164 hartree
pointgroup: C01 [X(C9H19N3O1S2)]
dipole: -1.7794276 -0.8585443 1.0045737 debye
polarizability: 191.9414118|21.6291711|126.1818609|-15.1136983|3.3641166|178.5543483 unknown
InChI: InChI=1S/C9H19N3OS2/c1-4-7-12(10-13)8-15-9(14)11(5-2)6-3/h4-8H2,1-3H3
charge 0 multiplicity 1
34 atoms
S  -0.053166 0.021107 -1.521828
S  -0.630118 1.12935 1.379627
O  3.16845 0.254946 -2.950359
N  -2.173128 -0.670775 0.023348
N  2.654608 0.432893 -0.76159
N  3.550197 0.009488 -1.747651
C  3.023875 0.049583 0.619415
C  -2.533905 -1.562731 -1.116089
C  -3.130425 -0.674895 1.167097
C  2.437187 -1.309225 1.067913
C  1.435225 1.140592 -1.095072
C  -1.058982 0.122252 0.056269
C  -3.419793 -0.861755 -2.167733
C  -2.759457 -1.725571 2.232739
C  2.859113 -1.636573 2.515635
H  2.678587 0.84854 1.300126
H  4.127534 0.010289 0.650705
H  -3.061894 -2.433371 -0.68585
H  -1.608575 -1.944351 -1.582511
H  -4.13486 -0.873939 0.749762
H  -3.12997 0.333764 1.613479
H  1.334856 -1.273227 0.998596
H  2.789845 -2.096234 0.374417
H  1.095174 1.750525 -0.238713
H  1.590616 1.725402 -2.01404
H  -4.358412 -0.490313 -1.718463
H  -2.887877 -0.008739 -2.621571
H  -3.682667 -1.573134 -2.971388
H  -2.734565 -2.745235 1.806875
H  -1.770032 -1.496303 2.663005
H  -3.504482 -1.712817 3.048696
H  3.960308 -1.673972 2.616171
H  2.477508 -0.875454 3.22172
H  2.459525 -2.61712 2.830361
