program: Gaussian 09
title: 000187343
version: EM64L-G09RevD.01
frameworkgroup: C1[X(C18H13FO2)]
method: RPBEPBE
basis: SDD
operation: Freq
keyword: #p
keyword: freq=noraman
keyword: PBEPBE/SDD
title: #p freq=noraman PBEPBE/SDD
converged: YES YES NO NO
title: Mulliken charges:
elementType: F O O C C C C C C C C C C C C C C C C C C H H H H H H H H H H H H H
charge: -0.195676 -0.425546 -0.429511 0.375278 -0.342769 0.190198 -0.194657 0.328129 -0.684262 0.196312 -0.046616 0.173331 -0.346762 -0.252917 0.420444 -0.441209 -0.461926 -0.346675 -0.429785 -0.258868 -0.245836 0.275032 0.261920 0.240632 0.265783 0.243854 0.269490 0.240467 0.228282 0.342445 0.242742 0.343834 0.232029 0.232816
chargesum: 0.00000
title: Mulliken charges with hydrogens summed into heavy atoms:
elementType: F O O C C C C C C C C C C C C C C C C C C
charge: -0.195676 -0.083102 -0.085677 0.375278 -0.067737 0.190198 0.067263 0.328129 -0.443630 0.196312 -0.046616 0.173331 -0.080979 -0.009064 0.420444 -0.171719 -0.221459 -0.118393 -0.187043 -0.026839 -0.013020
polarizability: 3.69552313e+02 -9.16976924e+00 2.12925798e+02 4.93423432e+00 -2.72504862e+00 9.76523941e+01
1716.lowfreq: -0.0003 -0.0001 0.0004 3.4208 3.7716 13.3174 43.5061 54.9123 82.8072
frequency: 43.4837 54.9067 82.8046 98.8043 127.8452 144.3194 195.7068 202.4121 243.0424 251.4954 260.9470 295.0387 297.2936 314.7945 324.3544 338.7025 374.8839 422.7908 439.3994 467.6206 492.8255 506.9699 508.9245 544.7145 557.5504 573.4677 579.7527 606.5616 638.6293 646.6574 685.9612 736.0623 749.6891 764.0359 790.5473 794.9704 810.1378 850.0719 855.6469 866.3794 884.8572 888.6835 902.5314 921.5767 942.6761 952.1581 961.4122 985.5609 988.4748 996.7919 1004.6894 1038.3263 1069.2760 1123.0447 1158.3853 1165.6484 1180.1869 1182.6778 1196.1155 1216.4719 1231.6293 1234.7172 1243.0091 1274.9233 1295.1646 1318.1191 1331.8207 1349.6911 1353.5209 1375.1136 1387.4803 1402.8884 1407.9627 1434.9374 1445.8935 1463.3214 1493.8224 1520.7009 1567.6580 1604.2772 1621.7159 1628.8853 1636.3660 3070.6187 3074.5072 3125.3250 3132.5213 3136.7687 3140.8428 3149.7102 3157.6782 3166.2725 3168.7007 3172.5136 3535.9273 3540.9428
redmass: 5.7170 4.8566 4.8722 7.7442 6.2934 4.7702 4.7893 4.4505 4.7105 3.8632 4.6918 2.0391 2.6905 1.3248 2.5607 4.6703 5.5770 3.1701 5.3404 4.7154 6.8672 4.3514 5.7332 4.5036 4.6243 3.8699 5.2889 4.6889 5.6793 5.7908 4.5389 2.9332 3.1142 1.3691 2.7867 3.8387 2.0400 1.8671 4.4971 4.3541 3.4378 1.6841 2.3207 3.7657 4.8398 4.1743 1.3750 1.2966 1.3396 1.3633 3.8998 2.2913 3.0888 2.1687 1.2969 1.1778 1.1188 1.3097 1.5800 1.3198 2.1044 2.0207 1.5609 1.7841 1.8995 2.9650 1.4635 1.3361 1.1983 2.8929 1.9919 4.3886 2.7027 3.3429 3.4839 3.9028 4.1115 4.1241 7.7337 6.6361 6.3817 7.2417 7.7213 1.0855 1.0868 1.0867 1.0890 1.0885 1.0862 1.0937 1.0918 1.0994 1.0990 1.0959 1.0662 1.0664
irintensity: 0.6721 0.7488 1.0004 1.5632 0.6427 0.7202 0.6790 3.7855 0.3653 5.1491 14.0054 37.3104 26.5584 69.7305 60.3006 11.0751 24.3471 7.9469 0.3949 2.6088 3.0871 1.7902 1.0403 0.7724 2.6210 6.6682 2.0130 4.8228 3.6775 8.2928 10.9693 7.9471 7.8253 76.8857 2.2753 0.3102 0.1521 62.3434 7.3067 48.6830 29.6624 6.8512 67.4897 91.5659 12.3388 35.7142 4.4743 2.6176 0.0124 0.2199 19.6789 6.1384 4.4837 10.2991 1.4321 0.6202 8.0844 60.2555 31.0931 24.9784 12.1890 13.3298 5.3580 6.1467 13.3895 34.8605 16.8026 39.5185 47.4404 16.6182 11.3746 0.3083 8.9908 14.9066 1.1744 5.6597 4.9724 16.4622 4.5867 5.0303 2.8964 3.0958 7.0292 12.4878 13.4515 2.7849 7.3645 8.2092 0.0531 12.7054 17.3357 22.1483 31.1904 9.3793 11.7113 13.1386
temp: 298.150 k
press: 1.00000 atm
elementType: 9 8 8 6 6 6 6 6 6 6 6 6 6 6 6 6 6 6 6 6 6 1 1 1 1 1 1 1 1 1 1 1 1 1
symmnumber: 1
zpe: 678855.0 jmol-1
zpe.correction: 0.258562 hartree
zpe.thermalcorrener: 0.275168 hartree
zpe.thermalcorrenthalpy: 0.276112 hartree
zpe.thermalcorrgfe: 0.214839 hartree
zpe.sumelectzpe: -942.565520 hartree
zpe.sumelectthermal: -942.548915 hartree
zpe.sumelectthermalent: -942.547971 hartree
zpe.sumelectthermalfe: -942.609244 hartree
dipole: 2.4937 1.2458 -0.0377
dipole: 2.7878
quadrupole: -108.0393 -120.4893 -126.7158
quadrupole: -9.7832 4.4288 -1.1582
quadrupole: 10.3755 -2.0745 -8.3010 -9.7832 4.4288 -1.1582
hfenergy: -942.8240826 hartree
pointgroup: C01 [X(C18H13F1O2)]
dipole: 0.9686649 0.5140204 -0.0216226 debye
polarizability: 369.8343621|-5.0713098|212.3571093|6.9134185|-5.5647602|97.9390333 unknown
InChI: InChI=1S/C18H13FO2/c19-17-12-6-5-10-3-1-2-4-11(10)14(12)9-15-13(17)7-8-16(20)18(15)21/h1-9,16,18,20-21H
charge 0 multiplicity 1
34 atoms
F  -1.14919 3.048747 -0.184498
O  -2.856388 -2.037311 -1.68984
O  -4.111843 -1.409629 1.784516
C  -1.561308 -0.642288 -0.117542
C  -2.684179 -1.658485 -0.260886
C  -1.905605 0.755902 -0.156574
C  -4.039388 -1.176861 0.316098
C  0.851023 -0.099642 -0.012527
C  -0.224421 -1.041971 -0.037591
C  0.528807 1.30661 -0.071977
C  -0.843791 1.667055 -0.142448
C  2.257889 -0.495638 0.063294
C  -3.313725 1.174111 -0.192698
C  -4.32868 0.278424 0.006183
C  3.277114 0.527279 0.076525
C  1.572843 2.303561 -0.055508
C  2.898123 1.921014 0.016041
C  2.674743 -1.861745 0.123996
C  4.654641 0.153494 0.148927
C  4.031149 -2.206122 0.194532
C  5.032649 -1.192632 0.20733
H  -2.425103 -2.611566 0.227843
H  -4.820698 -1.841243 -0.087706
H  -0.01351 -2.115143 -0.017607
H  -3.523757 2.238002 -0.34251
H  -5.372858 0.608127 0.02192
H  1.290586 3.358816 -0.100743
H  3.69173 2.677002 0.028391
H  1.930446 -2.663416 0.114838
H  -2.982113 -1.208916 -2.222621
H  5.415346 0.94299 0.157553
H  -3.603842 -0.689075 2.240527
H  4.323511 -3.26073 0.239865
H  6.0908 -1.469622 0.262496
