program: Gaussian 09
title: 000187341
version: EM64L-G09RevD.01
frameworkgroup: C1[X(C18H13FO2)]
method: RPBEPBE
basis: SDD
operation: Freq
keyword: #p
keyword: freq=noraman
keyword: PBEPBE/SDD
title: #p freq=noraman PBEPBE/SDD
converged: NO YES NO NO
title: Mulliken charges:
elementType: F O O C C C C C C C C C C C C C C C C C C H H H H H H H H H H H H H
charge: -0.196127 -0.435629 -0.446025 -0.273948 0.188657 0.084953 0.341240 -0.134248 0.215497 -0.308958 -0.387957 -0.241621 -0.736740 -0.439383 0.513265 -0.053548 0.179259 -0.447417 -0.380458 -0.238282 -0.234144 0.282040 0.208200 0.224000 0.274505 0.256777 0.236575 0.271927 0.337062 0.248332 0.268712 0.358073 0.231323 0.234089
chargesum: 0.00000
title: Mulliken charges with hydrogens summed into heavy atoms:
elementType: F O O C C C C C C C C C C C C C C C C C C
charge: -0.196127 -0.098568 -0.087952 0.008092 0.188657 0.084953 0.341240 0.073952 0.215497 -0.084958 -0.113452 0.015157 -0.500164 -0.167456 0.513265 -0.053548 0.179259 -0.199086 -0.111747 -0.006959 -0.000055
polarizability: 3.78795594e+02 -1.37313832e+01 2.18904830e+02 2.59167155e+00 1.21861333e+00 8.82320555e+01
1716.lowfreq: -8.3683 -0.0006 -0.0005 0.0007 4.8619 10.4677 48.4324 55.3636 95.8592
frequency: 48.4062 55.3609 95.8580 115.4261 129.7640 154.6994 210.6731 235.3752 250.1665 256.6652 268.7321 290.6853 304.4824 325.0452 369.4717 403.7599 421.9710 427.7658 458.0603 470.3438 480.1989 493.6793 515.4339 524.8396 540.0735 571.6983 577.9586 590.0180 624.9809 644.8180 680.8314 720.1875 759.2219 760.4481 785.2069 789.6088 816.4367 826.8804 853.1111 863.3833 881.7454 911.3236 916.7400 955.3941 962.8328 970.3161 973.2212 987.7348 994.9700 1016.4582 1022.6869 1038.4365 1073.8338 1094.8367 1150.1337 1159.2635 1172.0794 1177.8092 1195.5588 1221.6186 1231.1689 1235.0680 1244.4388 1259.7538 1284.5656 1319.2562 1334.7630 1344.2473 1356.0582 1365.3807 1393.2634 1402.8804 1410.5638 1424.8848 1439.6956 1451.7964 1483.6495 1541.3220 1556.6900 1580.2468 1616.4171 1638.6857 1640.2234 2850.9593 3007.6890 3125.9633 3140.9169 3142.0753 3146.1109 3154.9454 3157.7048 3172.2255 3172.6468 3173.3761 3525.7144 3527.9098
redmass: 5.5508 6.2365 4.6386 5.2732 6.2541 5.2924 5.2087 5.4830 4.6726 6.0179 5.9045 7.7681 3.7151 3.9324 1.1911 5.7444 6.0203 3.0568 2.8340 3.1180 1.6919 3.4395 4.9915 3.9340 5.4891 4.9208 5.1635 3.5169 4.9979 3.9602 5.5952 2.2235 1.6504 3.3380 2.7338 2.5055 3.7763 3.5050 1.7535 1.5042 5.6785 4.0284 2.2994 2.6585 3.1841 1.8638 1.3877 1.3226 1.3294 2.2723 3.3057 4.3945 3.0151 2.3448 1.5842 1.2917 1.1869 1.2067 1.4065 1.4533 1.5157 1.1710 1.6228 1.7940 2.8723 1.6095 2.4161 2.1406 1.2198 1.9947 2.9420 2.6349 2.6050 5.9321 4.8078 3.0730 3.1621 6.9162 7.3077 6.3239 7.0105 7.4872 7.2717 1.0793 1.0831 1.0867 1.0896 1.0870 1.0879 1.0892 1.0949 1.0987 1.0975 1.0986 1.0653 1.0654
irintensity: 0.3442 1.1941 1.9452 2.1104 1.1776 0.9479 4.5158 4.2724 5.7557 1.6139 4.0948 2.5015 1.5118 1.6898 72.6283 0.4568 1.6544 0.8114 14.6643 59.3059 152.1431 22.8347 0.8342 20.7097 5.0353 7.7775 7.2389 2.7459 6.1468 1.0083 2.2498 44.3135 37.0530 15.9302 6.6020 18.6320 4.4805 14.2571 38.9479 21.9883 7.0627 34.2356 12.3133 36.6878 27.6409 11.7210 5.4129 1.1658 0.0075 24.0683 120.4710 17.0423 32.5456 11.2742 11.8082 7.9392 1.9203 9.4005 21.2177 61.4178 20.3463 45.5214 6.7085 0.9106 3.9265 3.8405 37.6385 8.1396 60.1138 59.5362 3.4646 9.8029 10.6813 3.6346 7.6701 2.5808 10.9761 2.7791 4.8103 2.0368 12.3050 1.3264 6.6584 55.3183 9.6002 0.3472 11.1172 0.5959 2.3946 4.1080 21.5620 15.0000 16.7477 14.6978 20.6377 1.2035
temp: 298.150 k
press: 1.00000 atm
elementType: 9 8 8 6 6 6 6 6 6 6 6 6 6 6 6 6 6 6 6 6 6 1 1 1 1 1 1 1 1 1 1 1 1 1
symmnumber: 1
zpe: 678533.7 jmol-1
zpe.correction: 0.258440 hartree
zpe.thermalcorrener: 0.274704 hartree
zpe.thermalcorrenthalpy: 0.275648 hartree
zpe.thermalcorrgfe: 0.215372 hartree
zpe.sumelectzpe: -942.557154 hartree
zpe.sumelectthermal: -942.540890 hartree
zpe.sumelectthermalent: -942.539945 hartree
zpe.sumelectthermalfe: -942.600221 hartree
dipole: 1.6651 -0.9507 1.3754
dipole: 2.3597
quadrupole: -118.7526 -115.4937 -123.4023
quadrupole: -11.4239 -6.4344 2.0614
quadrupole: 0.4636 3.7225 -4.1861 -11.4239 -6.4344 2.0614
hfenergy: -942.8155934 hartree
pointgroup: C01 [X(C18H13F1O2)]
dipole: 0.6408113 0.397282 -0.5416903 debye
polarizability: 378.4711121|14.1055703|218.578943|-9.6428767|6.430426|88.8824244 unknown
InChI: InChI=1S/C18H13FO2/c19-17-11-4-2-1-3-10(11)9-15-12-7-8-16(20)18(21)14(12)6-5-13(15)17/h1-9,16,18,20-21H
charge 0 multiplicity 1
34 atoms
F  2.382371 -2.753377 -0.209916
O  -4.605056 -1.53555 -0.178841
O  -5.563355 1.217387 0.182831
C  -3.753635 -0.452494 0.3628
C  -2.257708 -0.701482 0.178688
C  -1.374658 0.39894 0.196259
C  0.058931 0.170806 0.093175
C  -4.200947 0.89005 -0.240171
C  0.535004 -1.20826 -0.010542
C  -1.939861 1.755892 0.351838
C  -1.764804 -2.042174 0.090826
C  -3.269893 2.002187 0.179014
C  1.0119 1.220749 0.078864
C  -0.400879 -2.296906 -0.00683
C  2.404207 0.97442 -0.020766
C  1.927437 -1.416761 -0.108894
C  2.896795 -0.394879 -0.116656
C  3.370561 2.043299 -0.032246
C  4.310487 -0.643196 -0.216478
C  4.732339 1.776438 -0.129649
C  5.206319 0.420832 -0.222298
H  -4.009879 -0.450945 1.440736
H  -4.166018 0.789634 -1.356186
H  -1.272718 2.584161 0.608407
H  -2.485454 -2.865781 0.117917
H  -3.700995 3.00321 0.279662
H  0.682314 2.262462 0.133686
H  -0.02304 -3.320603 -0.075326
H  -4.358975 -1.678635 -1.130473
H  3.011099 3.076509 0.038498
H  4.661955 -1.676612 -0.286611
H  -6.111491 0.398207 0.056826
H  5.454799 2.599614 -0.136249
H  6.282244 0.231155 -0.297796
